Benzoic acid, 2-bromo-
- Formula: C7H5BrO2
- Molecular weight: 201.017
- IUPAC Standard InChIKey: XRXMNWGCKISMOH-UHFFFAOYSA-N
- CAS Registry Number: 88-65-3
- Chemical structure:
View 3d structure (requires JavaScript / HTML 5) - Other names: Benzoic acid, o-bromo-; o-Bromobenzoic acid; 2-Bromobenzoic acid

Gas phase thermochemistry data

Data compiled by: Hussein Y. Afeefy, Joel F. Liebman, and Stephen E. Stein
Quantity | Value | Units | Method | Reference | Comment |
---|---|---|---|---|---|
ΔfH°gas | -246.9 ± 2.1 | kJ/mol | Ccr | Sabbah and Rojas Aguilar, 1996 | |
ΔfH°gas | -257.4 ± 1.8 | kJ/mol | Ccr | Ferrao and Pilcher, 1987 |

Condensed phase thermochemistry data

Data compiled as indicated in comments:
ALS - Hussein Y. Afeefy, Joel F. Liebman, and Stephen E. Stein
DH - Eugene S. Domalski and Elizabeth D. Hearing
Quantity | Value | Units | Method | Reference | Comment |
---|---|---|---|---|---|
ΔfH°solid | -342.8 ± 2.1 | kJ/mol | Ccr | Sabbah and Rojas Aguilar, 1996 | ALS |
ΔfH°solid | -368.3 ± 1.4 | kJ/mol | Ccr | Ferrao and Pilcher, 1987 | ALS |
Quantity | Value | Units | Method | Reference | Comment |
ΔcH°solid | -3126.3 ± 2.1 | kJ/mol | Ccr | Sabbah and Rojas Aguilar, 1996 | ALS |
ΔcH°solid | -3100.8 ± 1.0 | kJ/mol | Ccr | Ferrao and Pilcher, 1987 | ALS |
ΔcH°solid | -3084.9 ± 4.2 | kJ/mol | Ccb | Holdiness, 1983 | ALS |
Constant pressure heat capacity of solid
Cp,solid (J/mol*K) | Temperature (K) | Reference | Comment |
---|---|---|---|
153.8 | 298.15 | Ferrao and Pilcher, 1987 | Value given as Cp = 0.765 J K-1 g-1.; DH |

Phase change data

Data compiled as indicated in comments:
TRC - Thermodynamics Research Center, NIST Boulder Laboratories, Chris Muzny director
AC - William E. Acree, Jr., James S. Chickos
ALS - Hussein Y. Afeefy, Joel F. Liebman, and Stephen E. Stein
Quantity | Value | Units | Method | Reference | Comment |
---|---|---|---|---|---|
Tfus | 420.9 | K | N/A | Lamneck, 1954 | Uncertainty assigned by TRC = 3. K; TRC |
Tfus | 421.7 | K | N/A | Lamneck, 1954 | Uncertainty assigned by TRC = 3. K; TRC |
Tfus | 421.9 | K | N/A | Lamneck, 1954 | Uncertainty assigned by TRC = 3. K; TRC |
Tfus | 419.9 | K | N/A | Lamneck, 1954 | Uncertainty assigned by TRC = 4. K; TRC |
Tfus | 419.2 | K | N/A | Lamneck, 1954 | Uncertainty assigned by TRC = 4. K; TRC |
Quantity | Value | Units | Method | Reference | Comment |
ΔsubH° | 108.5 ± 0.6 | kJ/mol | ME | Ribeiro da Silva, Fonseca, et al., 2005 | Based on data from 328. to 347. K.; AC |
ΔsubH° | 95.9 ± 0.4 | kJ/mol | C | Tan and Raphael, 1994 | AC |
ΔsubH° | 110.9 ± 1.1 | kJ/mol | C | Ferrao and Pilcher, 1987 | ALS |
ΔsubH° | 110.9 ± 1.1 | kJ/mol | C | Ferrao and Pilcher, 1987 | AC |
Enthalpy of sublimation
ΔsubH (kJ/mol) | Temperature (K) | Method | Reference | Comment |
---|---|---|---|---|
106.8 ± 0.4 | 338. | ME | Ribeiro da Silva, Fonseca, et al., 2005 | Based on data from 328. to 347. K.; AC |
Enthalpy of fusion
ΔfusH (kJ/mol) | Temperature (K) | Method | Reference | Comment |
---|---|---|---|---|
24.83 | 421.6 | DSC | Ribeiro da Silva, Fonseca, et al., 2005 | AC |

Van Den Dool and Kratz RI, non-polar column, temperature ramp

Column type | Active phase | I | Reference | Comment |
---|---|---|---|---|
Packed | SE-30 | 1459. | Peng, Ding, et al., 1988 | He, Supelcoport and Chromosorb, 40. C @ 4. min, 10. K/min, 250. C @ 60. min; Column length: 3.05 m |

References

Sabbah and Rojas Aguilar, 1996
Sabbah, R.; Rojas Aguilar, A.,
Thermodynamic study of the three isomers of bromo and iodobenzoic acids. Part II,
Struct. Chem., 1996, 7, 383-390. [all data]
Ferrao and Pilcher, 1987
Ferrao, M.C.C.H.; Pilcher, G.,
Enthalpies of combustion of the three bromobenzoic acids by rotating-bomb calorimetry,
J. Chem. Thermodyn., 1987, 19, 543-548. [all data]
Holdiness, 1983
Holdiness, M.R.,
Heats of atomization and resonance energy of some ortho-substituted benzoic acids,
Thermochim. Acta, 1983, 71, 257-263. [all data]
Lamneck, 1954
Lamneck, J.H.,
Bromination of the two propylbenzenes and three butylbenzenes,
J. Am. Chem. Soc., 1954, 76, 1106. [all data]
Ribeiro da Silva, Fonseca, et al., 2005
Ribeiro da Silva, Manuel A.V.; Fonseca, José M.S.; Carvalho, Rui P.B.M.; Monte, Manuel J.S.,
Thermodynamic study of the sublimation of six halobenzoic acids,
The Journal of Chemical Thermodynamics, 2005, 37, 3, 271-279, https://doi.org/10.1016/j.jct.2004.09.005
. [all data]
Tan and Raphael, 1994
Tan, Z.-C.; Raphael, S.,
Thermodynamic study of the three isomers of bromobenzoic acid,
Sci. China, Ser. B: Chem., Life Sci., Earth Sci., 1994, 37, 6, 641. [all data]
Peng, Ding, et al., 1988
Peng, C.T.; Ding, S.F.; Hua, R.L.; Yang, Z.C.,
Prediction of Retention Indexes I. Structure-Retention Index Relationship on Apolar Columns,
J. Chromatogr., 1988, 436, 137-172, https://doi.org/10.1016/S0021-9673(00)94575-8
. [all data]