2-Cyclopropen-1-one, 2,3-diphenyl-
- Formula: C15H10O
- Molecular weight: 206.2393
- IUPAC Standard InChIKey: HCIBTBXNLVOFER-UHFFFAOYSA-N
- CAS Registry Number: 886-38-4
- Chemical structure:

Gas phase thermochemistry data

Data compiled by: Hussein Y. Afeefy, Joel F. Liebman, and Stephen E. Stein
Quantity | Value | Units | Method | Reference | Comment |
---|---|---|---|---|---|
ΔfH°gas | 317.7 ± 8.2 | kJ/mol | Ccr | Steele, Gammon, et al., 1985 | |
ΔfH°gas | 360. ± 20. | kJ/mol | Cpha | Grabowski, Simon, et al., 1984 | |
ΔfH°gas | 552.3 | kJ/mol | Ccb | Hopkins, Bostwick, et al., 1976 |

Phase change data

Data compiled as indicated in comments:
ALS - Hussein Y. Afeefy, Joel F. Liebman, and Stephen E. Stein
AC - William E. Acree, Jr., James S. Chickos
Quantity | Value | Units | Method | Reference | Comment |
---|---|---|---|---|---|
ΔsubH° | 119.7 ± 8.0 | kJ/mol | V | Steele, Gammon, et al., 1985 | ALS |
Enthalpy of sublimation
ΔsubH (kJ/mol) | Temperature (K) | Method | Reference | Comment |
---|---|---|---|---|
120. ± 8. | 365. | HSA | Steele, Gammon, et al., 1985 | Based on data from 353. to 378. K.; AC |
141. ± 4.2 | 323. | V | Hopkins, Bostwick, et al., 1976 | ALS |
141. ± 4. | 333. | ME | Hopkins, Bostwick, et al., 1976 | Based on data from 323. to 343. K. See also Stephenson and Malanowski, 1987.; AC |

Reaction thermochemistry data

Data compiled by: Hussein Y. Afeefy, Joel F. Liebman, and Stephen E. Stein
Individual Reactions
By formula: C15H10O = C14H10 + CO
Quantity | Value | Units | Method | Reference | Comment |
---|---|---|---|---|---|
ΔrH° | -28. ± 5.0 | kJ/mol | Cpha | Hung and Grabowski, 1992 | liquid phase; solvent: Alkane |
ΔrH° | 18. ± 10. | kJ/mol | Cpha | Herman and Goodman, 1989 | solid phase; solvent: Acetonitrile/water |
ΔrH° | -41. ± 12. | kJ/mol | Cpha | Grabowski, Simon, et al., 1984 | liquid phase; solvent: Benzene |

Gas phase ion energetics data

Data compiled as indicated in comments:
LLK - Sharon G. Lias, Rhoda D. Levin, and Sherif A. Kafafi
Ionization energy determinations
IE (eV) | Method | Reference | Comment |
---|---|---|---|
10.56 | PE | Muller, Schweig, et al., 1978 | Vertical value; LLK |
8.47 | PE | Dehmlow, Dehmlow, et al., 1977 | Vertical value; LLK |

Condensed phase thermochemistry data

Data compiled by: Hussein Y. Afeefy, Joel F. Liebman, and Stephen E. Stein

Quantity Value Units Method Reference Comment
Δcliquid-1807.4 ± 4.8kcal/molCcbGreenberg, Tomkins, et al., 1983Corresponding Δfliquid = 55.03 kcal/mol (simple calculation by NIST; no Washburn corrections)
Quantity Value Units Method Reference Comment
Δfsolid47.33 ± 0.47kcal/molCcrSteele, Gammon, et al., 1985
Quantity Value Units Method Reference Comment
Δcsolid-1799.67 ± 0.43kcal/molCcrSteele, Gammon, et al., 1985Corresponding Δfsolid = 47.330 kcal/mol (simple calculation by NIST; no Washburn corrections)
Δcsolid-1850.6kcal/molCcbHopkins, Bostwick, et al., 1976Corresponding Δfsolid = 98.3 kcal/mol (simple calculation by NIST; no Washburn corrections)

References

Steele, Gammon, et al., 1985
Steele, W.V.; Gammon, B.E.; Smith, N.K.; Chickos, J.S.; Greenberg, A.; Liebman, J.F.,
The standard molar enthalpy of formation of 2,3-diphenylcycloprop-2-en-1-one,
J. Chem. Thermodyn., 1985, 17, 505-511. [all data]
Grabowski, Simon, et al., 1984
Grabowski, J.J.; Simon, J.D.; Peters, K.S.,
Heat of formation of diphenylcyclopropenone by photoacoustic calorimetry,
J. Am. Chem. Soc., 1984, 106, 4615-4616. [all data]
Hopkins, Bostwick, et al., 1976
Hopkins, H.P., Jr.; Bostwick, D.; Alexander, C.J.,
The thermochemistry of diphenylcyclopropenone. Strain vs. delocalization energy,
J. Am. Chem. Soc., 1976, 98, 1355-1357. [all data]
Stephenson and Malanowski, 1987
Stephenson, Richard M.; Malanowski, Stanislaw,
Handbook of the Thermodynamics of Organic Compounds, 1987, https://doi.org/10.1007/978-94-009-3173-2
. [all data]
Hung and Grabowski, 1992
Hung, R.R.; Grabowski, J.J.,
Enthalpy measurements in organic solvents by photoacoustic calorimetry: a solution to the reaction volume problem,
J. Am. Chem. Soc., 1992, 114, 351-353. [all data]
Herman and Goodman, 1989
Herman, M.S.; Goodman, J.L.,
Determination of the enthalpy and reaction volume changes of organic photoreactions using photoacoustic calorimetry,
J. Am. Chem. Soc., 1989, 111, 1849-1854. [all data]