c-alanylglycine
- Formula: C5H8N2O2
- Molecular weight: 128.1292
- IUPAC Standard InChIKey: YAMUQIKBMNEEGI-PWNYCUMCSA-N
- CAS Registry Number: 88547-15-3
- Chemical structure:
View 3d structure (requires JavaScript / HTML 5) - Permanent link for this species. Use this link for bookmarking this species for future reference.

Reaction thermochemistry data

Data compiled by: Robert C. Dunbar
Individual Reactions
By formula: Na+ + C5H8N2O2 = (Na+ • C5H8N2O2)
Quantity | Value | Units | Method | Reference | Comment |
---|---|---|---|---|---|
ΔrH° | 149. ± 7.1 | kJ/mol | CIDC | Cerda, Hoyau, et al., 1998 |

Ion clustering data

Data compiled by: Robert C. Dunbar
Clustering reactions
By formula: Na+ + C5H8N2O2 = (Na+ • C5H8N2O2)
Quantity | Value | Units | Method | Reference | Comment |
---|---|---|---|---|---|
ΔrH° | 149. ± 7.1 | kJ/mol | CIDC | Cerda, Hoyau, et al., 1998 |

References

Cerda, Hoyau, et al., 1998
Cerda, B.A.; Hoyau, S.; Ohanessian, G.; Wesdemiotis, C.,
PAs of Peptides,
J. Am. Chem. Soc., 1998, 120, 2437. [all data]