p-Octyloxybenzonitrile
- Formula: C15H21NO
- Molecular weight: 231.3333
- IUPAC Standard InChIKey: GFNSBTARZPEIPN-UHFFFAOYSA-N
- CAS Registry Number: 88374-55-4
- Chemical structure:

Phase change data

Data compiled by: Robert L. Brown and Stephen E. Stein
Reduced pressure boiling point
Tboil (K) | Pressure (bar) | Reference |
---|---|---|
444. to 446. | 0.003 | Frinton Laboratories Inc., 1986 |

References

Frinton Laboratories Inc., 1986
Frinton Laboratories Inc.,
Catalog Number 11, Frinton Laboratories Inc., Vineland, NJ, 1986, 99. [all data]