Bis(n-heptylammonium)tetrachlorocadmate

Condensed phase thermochemistry data

Data compiled by: Eugene S. Domalski and Elizabeth D. Hearing

Quantity Value Units Method Reference Comment
solid,1 bar779.0J/mol*KN/AWhite, Davies, et al., 1983

Constant pressure heat capacity of solid

Cp,solid (J/mol*K) Temperature (K) Reference Comment
633.6298.15White, Davies, et al., 1983T = 10 to 325 K.

References

White, Davies, et al., 1983
White, M.A.; Davies, N.J.; Staveley, L.A.K., Polymorphism in bis(n-heptylammonium) tetrachloromanganate and -cadmate as determined by heat-capacity measurements from 10 to 325 K, J. Chem. Soc., Faraday Trans., 1983, 2 79, 1653-1661. [all data]