Vanillin, acetate
- Formula: C10H10O4
- Molecular weight: 194.1840
- IUPAC Standard InChIKey: PZSJOBKRSVRODF-UHFFFAOYSA-N
- CAS Registry Number: 881-68-5
- Chemical structure:
View 3d structure (requires JavaScript / HTML 5) - Other names: Benzaldehyde, 4-(acetyloxy)-3-methoxy-; Acetovanillin; Acetylvanillin; O-Acetylvanillin; 4-Acetoxy-3-methoxybenzaldehyde; 4-O-Acetylvanillin; 4-Formyl-2-methoxyphenol acetate; 4-Formyl-2-methoxyphenyl acetate; Benzaldehyde, 4-acetoxy-3-methoxy; 4-(Acetyloxy)-3-methoxybenzaldehyde; NSC 25863; NSC 8499

Van Den Dool and Kratz RI, non-polar column, temperature ramp

Column type | Active phase | I | Reference | Comment |
---|---|---|---|---|
Capillary | CP Sil 5 CB | 1512. | Pino, Marbot, et al., 2002 | 30. m/0.25 mm/0.25 μm, H2, 60. C @ 10. min, 2. K/min, 280. C @ 40. min |
Capillary | DB-1 | 1465. | Johnson, Urso, et al., 1997 | 30. m/0.2 mm/0.25 μm, 50. C @ 2. min, 5. K/min, 300. C @ 5. min |

Van Den Dool and Kratz RI, non-polar column, custom temperature program

Column type | Active phase | I | Reference | Comment |
---|---|---|---|---|
Capillary | VF-5MS | 1540.8 | Tret'yakov, 2008 | 30. m/0.25 mm/0.25 μm, He; Program: Multi-step temperature program; T(initial)=60C; T(final)=270C |

Lee's RI, non-polar column, temperature ramp

Column type | Active phase | I | Reference | Comment |
---|---|---|---|---|
Capillary | DB-1 | 258.8 | Johnson, Urso, et al., 1997 | 30. m/0.2 mm/0.25 μm, 50. C @ 2. min, 5. K/min, 300. C @ 5. min |

References

Pino, Marbot, et al., 2002
Pino, J.A.; Marbot, R.; Bello, A.,
Volatile compounds of Psidium salutare (H.B.K.) Berg. fruit,
J. Agric. Food Chem., 2002, 50, 18, 5146-5148, https://doi.org/10.1021/jf0116303
. [all data]
Johnson, Urso, et al., 1997
Johnson, C.I.; Urso, A.; Geleta, L.,
Broad spectrum analysis of municipal and industrial effluents discharged into the Peace, Athabasca and Slave river basins: characterization of effluent samples, 1994 - Volume 1 of 2, Northern River Basins Study Project Report No. 121, Norther River Basins Study, Edmonton, Alberta, 1997, 27. [all data]
Tret'yakov, 2008
Tret'yakov, K.V.,
Retention Data. NIST Mass Spectrometry Data Center., NIST Mass Spectrometry Data Center, 2008. [all data]