Ethanone, 1-(2-thienyl)-
- Formula: C6H6OS
- Molecular weight: 126.176
- IUPAC Standard InChIKey: WYJOVVXUZNRJQY-UHFFFAOYSA-N
- CAS Registry Number: 88-15-3
- Chemical structure:
View 3d structure (requires JavaScript / HTML 5) - Other names: Ketone, methyl 2-thienyl; Methyl 2-thienyl ketone; 2-Acetothienone; 2-Acetylthiophene; 2-Thienyl methyl ketone; 2-Acetylthiophen; 2-Acetothiophene; 1-(2-Thienyl)ethanone; 2-Acethylthiophene; NSC 2345

Phase change data

Data compiled as indicated in comments:
BS - Robert L. Brown and Stephen E. Stein
TRC - Thermodynamics Research Center, NIST Boulder Laboratories, Chris Muzny director
AC - William E. Acree, Jr., James S. Chickos
Quantity | Value | Units | Method | Reference | Comment |
---|---|---|---|---|---|
Tboil | 486.7 | K | N/A | Weast and Grasselli, 1989 | BS |
Tboil | 486. to 487. | K | N/A | Buckingham and Donaghy, 1982 | BS |
Quantity | Value | Units | Method | Reference | Comment |
Tfus | 282. | K | N/A | Buckingham and Donaghy, 1982 | BS |
Tfus | 283.6 | K | N/A | Johnson, 1947 | Uncertainty assigned by TRC = 0.02 K; TRC |
Quantity | Value | Units | Method | Reference | Comment |
ΔvapH° | 58.8 ± 1.2 | kJ/mol | C | Roux, Temprado, et al., 2007 | AC |
Reduced pressure boiling point
Tboil (K) | Pressure (bar) | Reference | Comment |
---|---|---|---|
368.2 | 0.017 | Weast and Grasselli, 1989 | BS |
367.6 to 369.6 | 0.017 | Buckingham and Donaghy, 1982 | BS |

Gas phase ion energetics data

Data compiled by: Sharon G. Lias, Rhoda D. Levin, and Sherif A. Kafafi
Ionization energy determinations
IE (eV) | Method | Reference |
---|---|---|
9.20 ± 0.05 | EI | Linda, Marino, et al., 1971 |

Normal alkane RI, non-polar column, temperature ramp

Data compiled by: NIST Mass Spectrometry Data Center, William E. Wallace, director

Column type CapillaryCapillaryCapillaryCapillaryCapillary
Active phase DB-1DB-1DB-1DB-1DB-1
Column length (m) 60.60.60.60.60.
Carrier gas HeHe
Substrate
Column diameter (mm) 0.320.250.320.320.32
Phase thickness (μm) 1.01.00.250.250.25
Tstart (C) 40.40.50.50.50.
Tend (C) 280.260.250.250.250.
Heat rate (K/min) 2.2.4.4.4.
Initial hold (min)  5.
Final hold (min)  60.
I 1067.1066.1041.1043.1049.
ReferenceTai and Ho, 1998Yu, Wu, et al., 1994Flath, Matsumoto, et al., 1989Flath, Matsumoto, et al., 1989Flath, Matsumoto, et al., 1989
Comment MSDC-RI MSDC-RI MSDC-RI MSDC-RI MSDC-RI

References

Weast and Grasselli, 1989
CRC Handbook of Data on Organic Compounds, 2nd Editon, Weast,R.C and Grasselli, J.G., ed(s)., CRC Press, Inc., Boca Raton, FL, 1989, 1. [all data]
Buckingham and Donaghy, 1982
Buckingham, J.; Donaghy, S.M.,
Dictionary of Organic Compounds: Fifth Edition, Chapman and Hall, New York, 1982, 1. [all data]
Johnson, 1947
Johnson, G.C.,
Physical properties of 2-acetylthiophene,
J. Am. Chem. Soc., 1947, 69, 150-52. [all data]
Roux, Temprado, et al., 2007
Roux, María Victoria; Temprado, Manuel; Jiménez, Pilar; Notario, Rafael; Chickos, James S.; Santos, Ana Filipa L.O.M.; Ribeiro da Silva, Manuel A.V.,
Thermochemistry of 2- and 3-Acetylthiophenes: Calorimetric and Computational Study,
J. Phys. Chem. A, 2007, 111, 43, 11084-11092, https://doi.org/10.1021/jp0734169
. [all data]