2-Pyrrolidinone, 1-ethenyl-
- Formula: C6H9NO
- Molecular weight: 111.1418
- IUPAC Standard InChIKey: WHNWPMSKXPGLAX-UHFFFAOYSA-N
- CAS Registry Number: 88-12-0
- Chemical structure:
- Other names: N-Vinyl-2-pyrrolidone; 2-Pyrrolidinone, 1-vinyl-; N-Vinyl-2-pyrrolidinone; N-Vinylpyrrolidinone; N-Vinylpyrrolidone; Vinylbutyrolactam; Vinylpyrrolidinone; Vinylpyrrolidone; 1-Vinyl-2-pyrrolidinone; 1-Vinyl-2-pyrrolidinone, monomer; 1-Vinyl-2-pyrrolidone; 1-Vinylpyrrolidinone; Vinyl-2-pyrrolidone; 1-Vinylpyrrolidone; 1-Ethenyl-2-pyrrolidinone; V-Pyrol; NSC 10222

Phase change data

Data compiled by: William E. Acree, Jr., James S. Chickos
Enthalpy of fusion
ΔfusH (kJ/mol) | Temperature (K) | Reference |
---|---|---|
15.28 | 286.2 | Kulagina and Lebedev, 1997 |

Van Den Dool and Kratz RI, non-polar column, temperature ramp

Column type | Active phase | I | Reference | Comment |
---|---|---|---|---|
Capillary | MDN-5 | 1102. | Yoo, Pace, et al., 2004 | 30. m/0.32 mm/0.25 μm, He, 50. C @ 3. min, 10. K/min, 320. C @ 10. min |

Normal alkane RI, non-polar column, temperature ramp

Column type | Active phase | I | Reference | Comment |
---|---|---|---|---|
Capillary | MDN-5 | 1102. | Yoo, Pace, et al., 2004, 2 | 30. m/0.32 mm/0.25 μm, Helium, 50. C @ 3. min, 10. K/min, 320. C @ 10. min |
Capillary | BP-1 | 1077. | Health Safety Executive, 2000 | 50. m/0.22 mm/0.75 μm, He, 5. K/min; Tstart: 50. C; Tend: 200. C |

References

Kulagina and Lebedev, 1997
Kulagina, T.G.; Lebedev, B.V.,
Heat capacity and thermodynamic functions of N-vinylpyrrolidone at 0-330 K,
Zh. Fiz. Khim., 1997, 71, 5, 804. [all data]
Yoo, Pace, et al., 2004
Yoo, S.J.; Pace, G.V.; Khoo, B.K.; Lech, J.; Hartman, T.G.,
Mass Spectrometry and Gas Chromatographic Retention Indices of Selected UV/EB-Curable Monomers and Photoinitiators Commonly Used in Food Packaging Print and Coating Formulations, Radtech Report, Radtech Report; Technical Paper, 2004, 8. [all data]
Yoo, Pace, et al., 2004, 2
Yoo, S.J.; Pace, G.V.; Khoo, B.K.; Lech, J.; Hartman, T.G.,
Mass spectrometry and gas chromatographic retention indices of selected UV/EB-Curable monomers and photoinitiators commonly used in food packaging print and coating formulations,
RAD Tech. Report, 2004, 3, 60-68. [all data]
Health Safety Executive, 2000
Health Safety Executive,
MDHS 96 Volatile organic compounds in air - Laboratory method using pumed solid sorbent tubes, solvent desorption and gas chromatography
in Methods for the Determination of Hazardous Substances (MDHS) guidance, Crown, Colegate, Norwich, 2000, 1-24, retrieved from http://www.hse.gov.uk/pubns/mdhs/pdfs/mdhs96.pdf. [all data]