Phenol, 2,4,6-trichloro-
- Formula: C6H3Cl3O
- Molecular weight: 197.446
- IUPAC Standard InChIKey: LINPIYWFGCPVIE-UHFFFAOYSA-N
- CAS Registry Number: 88-06-2
- Chemical structure:
View 3d structure (requires JavaScript / HTML 5) - Other names: Dowicide 2S; Omal; Phenachlor; 2,4,6-Trichlorophenol; NCI-C02904; 1,3,5-Trichlorophenol; 2,4,6-Trichlorfenol; Dowcide 2S; Rcra waste number U231; 1,3,5-Trichloro-2-hydroxybenzene; 2,4,6 T; Trichloro-2-hydroxybenzene; NSC 2165

Phase change data

Data compiled as indicated in comments:
BS - Robert L. Brown and Stephen E. Stein
AC - William E. Acree, Jr., James S. Chickos
Quantity | Value | Units | Method | Reference | Comment |
---|---|---|---|---|---|
Tboil | 519.2 | K | N/A | Weast and Grasselli, 1989 | BS |
Quantity | Value | Units | Method | Reference | Comment |
ΔvapH° | 67.2 ± 0.3 | kJ/mol | GS | Verevkin, Emel'yanenko, et al., 2007 | Based on data from 343. to 375. K.; AC |
ΔvapH° | 66.1 ± 0.4 | kJ/mol | N/A | Mokbel, Pauchon, et al., 1995 | Based on data from 344. to 463. K. See also Verevkin, Emel'yanenko, et al., 2007.; AC |
Quantity | Value | Units | Method | Reference | Comment |
ΔsubH° | 82.3 ± 0.3 | kJ/mol | GS | Freitas, Oliveira, et al., 2007 | Based on data from 299. to 340. K.; AC |
Enthalpy of vaporization
ΔvapH (kJ/mol) | Temperature (K) | Method | Reference | Comment |
---|---|---|---|---|
62.5 | 359. | GS | Verevkin, Emel'yanenko, et al., 2007 | Based on data from 343. to 375. K.; AC |
58.2 | 404. | N/A | Mokbel, Pauchon, et al., 1995 | Based on data from 344. to 463. K. See also Verevkin, Emel'yanenko, et al., 2007.; AC |
58.8 | 364. | A | Stephenson and Malanowski, 1987 | Based on data from 349. to 519. K. See also Stull, 1947.; AC |
Antoine Equation Parameters
log10(P) = A − (B / (T + C))
P = vapor pressure (bar)
T = temperature (K)
View plot Requires a JavaScript / HTML 5 canvas capable browser.
Temperature (K) | A | B | C | Reference | Comment |
---|---|---|---|---|---|
349.7 to 519. | 5.36186 | 2599.065 | -34.151 | Stull, 1947 | Coefficents calculated by NIST from author's data. |

Kovats' RI, non-polar column, isothermal

View large format table.

Column type Active phase Temperature (C) I Reference Comment
CapillarySE-30160.1346.Evans and Haken, 1989Column length: 25. m; Column diameter: 0.32 mm
CapillarySE-30140.1331.Korhonen, 1984
CapillarySE-30160.1346.Korhonen, 1984
CapillarySE-30180.1360.Korhonen, 1984
PackedMethyl Silicone150.1367.Radecki, Grzybowski, et al., 1979

Kovats' RI, non-polar column, custom temperature program

View large format table.

Column type Active phase I Reference Comment
PackedSE-301349.Grzybowski, Lamparczyk, et al., 1980Chromosorb W HMDS (80-100 mesh); Column length: 2.9 m; Program: not specified

Kovats' RI, polar column, isothermal

View large format table.

Column type Active phase Temperature (C) I Reference Comment
CapillaryFFAP160.2301.Evans and Haken, 1989Column length: 25. m; Column diameter: 0.35 mm
CapillaryFFAP160.2301.Korhonen, 1984
CapillaryFFAP180.2306.Korhonen, 1984
CapillaryFFAP200.2321.Korhonen, 1984

Van Den Dool and Kratz RI, non-polar column, temperature ramp

View large format table.

Column type Active phase I Reference Comment
CapillaryOV-11335.0Gautzsch and Zinn, 19968. K/min; Tstart: 35. C; Tend: 300. C
CapillaryDB-11330.Gerbino and Castello, 199530. m/0.235 mm/0.25 μm, N2, 50. C @ 0. min, 10. K/min
CapillaryDB-11326.Gerbino and Castello, 199530. m/0.235 mm/0.25 μm, N2, 50. C @ 0. min, 5. K/min
CapillaryDB-51358.Rostad and Pereira, 198630. m/0.26 mm/0.25 μm, He, 50. C @ 4. min, 6. K/min, 300. C @ 20. min
CapillarySE-301349.Korhonen, 198410. K/min; Tstart: 100. C
CapillarySE-301327.Korhonen, 19842. K/min; Tstart: 100. C
CapillarySE-301339.Korhonen, 19846. K/min; Tstart: 100. C

Van Den Dool and Kratz RI, non-polar column, custom temperature program

View large format table.

Column type Active phase I Reference Comment
CapillaryVF-5MS1376.2Tret'yakov, 200730. m/0.25 mm/0.25 μm, He; Program: Multi-step temperature program; T(initial)=60C; T(final)=270C
Capillary5 % Phenyl methyl siloxane1347.Yasuhara, Shiraishi, et al., 199725. m/0.31 mm/0.52 μm, He; Program: 50C(2min) => (20C/min) => 120C => (7C/min) => 310C(10min)

Van Den Dool and Kratz RI, polar column, temperature ramp

View large format table.

Column type Active phase I Reference Comment
CapillaryDB-Wax2344.63Gerbino and Castello, 199530. m/0.235 mm/0.5 μm, N2, 5. K/min; Tstart: 100. C
CapillaryDB-Wax2355.43Gerbino and Castello, 199530. m/0.235 mm/0.5 μm, N2, 10. K/min; Tstart: 50. C
CapillaryDB-Wax2343.02Gerbino and Castello, 199530. m/0.235 mm/0.5 μm, N2, 5. K/min; Tstart: 50. C
CapillaryFFAP2284.Korhonen, 198410. K/min; Tstart: 100. C
CapillaryFFAP2270.Korhonen, 19846. K/min; Tstart: 100. C

Normal alkane RI, non-polar column, temperature ramp

View large format table.

Column type Active phase I Reference Comment
CapillaryHP-51348.Zenkevich, Moeder, et al., 200430. m/0.25 mm/0.25 μm, Helium, 50. C @ 3. min, 3. K/min, 280. C @ 20. min
CapillaryHP-11335.Boatright and Crum, 199730. m/0.25 mm/0.1 μm, He, 50. C @ 2. min, 5. K/min, 300. C @ 3. min
CapillaryOV-1011320.Messadi and Ali-Mokhnache, 19932. K/min; Column length: 25. m; Column diameter: 0.20 mm; Tstart: 80. C
CapillaryOV-1011325.Messadi and Ali-Mokhnache, 19932. K/min; Column length: 25. m; Column diameter: 0.20 mm; Tstart: 80. C
CapillaryOV-1011326.Messadi and Ali-Mokhnache, 19932. K/min; Column length: 25. m; Column diameter: 0.20 mm; Tstart: 80. C
CapillaryOV-1011336.Messadi and Ali-Mokhnache, 19932. K/min; Column length: 25. m; Column diameter: 0.20 mm; Tstart: 80. C
CapillaryUltra-11315.Okumura, 199125. m/0.32 mm/0.25 μm, He, 3. K/min; Tstart: 80. C; Tend: 260. C
CapillaryHP-51365.Spadone, Takeoka, et al., 1990H2, 16. K/min; Column length: 50. m; Column diameter: 0.3 mm; Tstart: 80. C; Tend: 250. C
CapillarySE-541348.Harland, Cumming, et al., 1986He, 50. C @ 2. min, 8. K/min, 250. C @ 12. min; Column length: 25. m; Column diameter: 0.32 mm

Normal alkane RI, non-polar column, custom temperature program

View large format table.

Column type Active phase I Reference Comment
CapillaryBP-51369.Helsper, Bücking, et al., 200630. m/0.25 mm/1. μm, He; Program: 40C(2min) => 4C/min => 150C => 8C/min => 250C (15min)
CapillaryMethyl Silicone1331.Yu and Zazhi, 2005Program: not specified
CapillaryPTE-51383.Nakano, Fujimori, et al., 199225. m/0.20 mm/0.33 μm; Program: 50 0C (2 min) 30 0C/min -> 200 0C 8 0C/min -> 280 0C (10 min)
CapillaryUltra-21386.Nakano, Fujimori, et al., 199225. m/0.20 mm/0.33 μm; Program: 50 0C (2 min) 30 0C/min -> 200 0C 8 0C/min -> 280 0C (10 min)
CapillarySE-301349.Peterson, 1992Program: not specified

Lee's RI, non-polar column, temperature ramp

View large format table.

Column type Active phase I Reference Comment
CapillaryDB-5231.0Donnelly, Abdel-Hamid, et al., 199330. m/0.32 mm/0.25 μm, He, 40. C @ 3. min, 8. K/min, 285. C @ 29.5 min
CapillaryDB-5232.09Rostad and Pereira, 198630. m/0.26 mm/0.25 μm, He, 50. C @ 4. min, 6. K/min, 300. C @ 20. min
CapillaryDB-5266.230Tong, Shore, et al., 1984He, 80. C @ 1. min, 3. K/min, 300. C @ 10. min; Column length: 30. m; Column diameter: 0.32 mm
CapillaryDB-5266.6Viau, Studak, et al., 1984Helium, 4. K/min; Column length: 30. m; Column diameter: 0.32 mm; Tstart: 90. C; Tend: 250. C

References

Weast and Grasselli, 1989
CRC Handbook of Data on Organic Compounds, 2nd Editon, Weast,R.C and Grasselli, J.G., ed(s)., CRC Press, Inc., Boca Raton, FL, 1989, 1. [all data]
Verevkin, Emel'yanenko, et al., 2007
Verevkin, Sergey P.; Emel'yanenko, Vladimir N.; Klamt, Andreas,
Thermochemistry of Chlorobenzenes and Chlorophenols: Ambient Temperature Vapor Pressures and Enthalpies of Phase Transitions,
J. Chem. Eng. Data, 2007, 52, 2, 499-510, https://doi.org/10.1021/je060429r
. [all data]
Mokbel, Pauchon, et al., 1995
Mokbel, I.; Pauchon, V.; Jose, J.,
Vapor pressures and sublimation pressures of 2,4-dichlorophenol, 2,6-dichlorophenol, and 2,4,6-trichlorophenol,
ELDATA: Int. Electron. J. Phys. Chem. Data, 1995, 1, 1, 53. [all data]
Freitas, Oliveira, et al., 2007
Freitas, Vera L.S.; Oliveira, Liliana I.P.; Ribeiro da Silva, Maria D.M.C.,
Standard molar enthalpies of formation of the acetylpyridine isomers,
The Journal of Chemical Thermodynamics, 2007, 39, 1, 39-43, https://doi.org/10.1016/j.jct.2006.06.004
. [all data]
Stephenson and Malanowski, 1987
Stephenson, Richard M.; Malanowski, Stanislaw,
Handbook of the Thermodynamics of Organic Compounds, 1987, https://doi.org/10.1007/978-94-009-3173-2
. [all data]
Stull, 1947
Stull, Daniel R.,
Vapor Pressure of Pure Substances. Organic and Inorganic Compounds,
Ind. Eng. Chem., 1947, 39, 4, 517-540, https://doi.org/10.1021/ie50448a022
. [all data]