4-tert-butyl-2,6-xylenol

Gas phase thermochemistry data

Data compiled by: Hussein Y. Afeefy, Joel F. Liebman, and Stephen E. Stein

Quantity Value Units Method Reference Comment
Δfgas-243.2kJ/molCcbBertholon, Giray, et al., 1971

Condensed phase thermochemistry data

Data compiled by: Hussein Y. Afeefy, Joel F. Liebman, and Stephen E. Stein

Quantity Value Units Method Reference Comment
Δfsolid-83.kcal/molCcbBertholon, Giray, et al., 1971
Quantity Value Units Method Reference Comment
Δcsolid-1660.kcal/molCcbBertholon, Giray, et al., 1971Corresponding Δfsolid = -83. kcal/mol (simple calculation by NIST; no Washburn corrections)

References

Bertholon, Giray, et al., 1971
Bertholon, G.; Giray, M.; Perrin, R.; Vincent-Falquet-Berny, M.F., No. 532. - Etude physicochimique des phenols. OX. - Ethanlpies de combustion et energies de resonance des alcoyl et aryphenols, Bull. Soc. Chim. France, 1971, 3180-3187. [all data]