Phenol, 2,6-bis(1,1-dimethylethyl)-4-(methoxymethyl)-
- Formula: C16H26O2
- Molecular weight: 250.3764
- IUPAC Standard InChIKey: SCXYLTWTWUGEAA-UHFFFAOYSA-N
- CAS Registry Number: 87-97-8
- Chemical structure:
View 3d structure (requires JavaScript / HTML 5) - Other names: p-Cresol, 2,6-di-tert-butyl-α-methoxy-; Ethyl Antioxidant 762; Ionol 4; 2,6-di-tert-Butyl-α-methoxy-para-cresol; DTB; Methyl ether of 3,5-di-tert-butyl-4-hydroxybenzene; Phenol, 2,6-di-tert-butyl-4-methoxymethyl-; 2,6-Di-tert-butyl-4-methoxymethylphenol; 2,6-Di-tert-butyl-α-methoxy-p-cresol; 3,5-Di-tert-butyl-4-hydroxybenzyl methyl ether; 4-Methoxymethyl-2,6-di-tert-butylphenol; Agidol 42; NSC 39711

Phase change data

Data compiled by: Thermodynamics Research Center, NIST Boulder Laboratories, Chris Muzny director
Quantity | Value | Units | Method | Reference | Comment |
---|---|---|---|---|---|
Tfus | 374.4 | K | N/A | Inozemtsev, Liakumovich, et al., 1972 | Uncertainty assigned by TRC = 0.2 K |

References

Inozemtsev, Liakumovich, et al., 1972
Inozemtsev, P.P.; Liakumovich, A.G.; Gracheva, Z.D.,
Russ. J. Phys. Chem., 1972, 46, 6, 914. [all data]