trans-1,4,5-trimethylcyclohexene
- Formula: C9H16
- Molecular weight: 124.2233
- IUPAC Standard InChIKey: FNZUANSNHGITHR-RKDXNWHRSA-N
- CAS Registry Number: 87954-39-0
- Chemical structure:
View 3d structure (requires JavaScript / HTML 5) - Stereoisomers:

Phase change data

Data compiled by: Thermodynamics Research Center, NIST Boulder Laboratories, Chris Muzny director
Quantity | Value | Units | Method | Reference | Comment |
---|---|---|---|---|---|
Tboil | 418. | K | N/A | Skita and Schneck, 1922 | Uncertainty assigned by TRC = 4. K |

References

Skita and Schneck, 1922
Skita, A.; Schneck, A.,
Stereoismerism in Cyclic Hydrocarbons,
Chem. Ber., 1922, 55, 144-52. [all data]