Myo-Inositol
- Formula: C6H12O6
- Molecular weight: 180.1559
- IUPAC Standard InChIKey: CDAISMWEOUEBRE-GPIVLXJGSA-N
- CAS Registry Number: 87-89-8
- Chemical structure:
View 3d structure (requires JavaScript / HTML 5) - Stereoisomers:
- Other names: Inositol, myo-; cis-1,2,3,5-trans-4,6-Cyclohexanehexol; i-Inositol; meso-Inositol; Dambose; Inosital; Inositene; Inositina; iso-Inositol; Meat sugar; Mesoinosit; Mesoinosite; Mesol; Mesovit; Myoinosite; MI; Nucite; Phaseomannite; Phaseomannitol; Scyllite; Inositol, meso-; Bios I; Cyclohexanehexol; Cyclohexitol; Inosite; Mouse antialopecia factor; Muscle sugar; Rat antispectacled eye factor; Hexahydroxycyclohexane

Condensed phase thermochemistry data

Data compiled by: Eugene S. Domalski and Elizabeth D. Hearing
Constant pressure heat capacity of solid
Cp,solid (J/mol*K) | Temperature (K) | Reference |
---|---|---|
218.31 | 298.15 | Lian, Chen, et al., 1982 |

Phase change data

Data compiled as indicated in comments:
TRC - Thermodynamics Research Center, NIST Boulder Laboratories, Chris Muzny director
AC - William E. Acree, Jr., James S. Chickos
DH - Eugene S. Domalski and Elizabeth D. Hearing
Quantity | Value | Units | Method | Reference | Comment |
---|---|---|---|---|---|
Tfus | 496.9 | K | N/A | Barone, DellaGatta, et al., 1990 | Uncertainty assigned by TRC = 0.2 K; TRC |
Quantity | Value | Units | Method | Reference | Comment |
ΔsubH° | 161. | kJ/mol | N/A | Barone, Gatta, et al., 1990 | AC |
ΔsubH° | 178. | kJ/mol | B | Barone, Gatta, et al., 1990 | AC |
Enthalpy of vaporization
ΔvapH (kJ/mol) | Temperature (K) | Method | Reference | Comment |
---|---|---|---|---|
119.0 ± 1.4 | 519. | TE | Barone, Gatta, et al., 1990 | Based on data from 497. to 524. K.; AC |
Enthalpy of sublimation
ΔsubH (kJ/mol) | Temperature (K) | Method | Reference | Comment |
---|---|---|---|---|
174.0 ± 2.6 | 448. | N/A | Chen, Oja, et al., 2006 | Based on data from 438. to 458. K.; AC |
154.7 ± 1.4 | 477. | TE | Barone, Gatta, et al., 1990 | AC |
168. | 454. to 472. | N/A | de Wit, 1983 | AC |
Enthalpy of fusion
ΔfusH (kJ/mol) | Temperature (K) | Reference | Comment |
---|---|---|---|
47.900 | 496.9 | Barone and Della Gatta, 1990 | DH |
47.9 | 496.9 | Domalski and Hearing, 1996 | AC |
Entropy of fusion
ΔfusS (J/mol*K) | Temperature (K) | Reference | Comment |
---|---|---|---|
96.4 | 496.9 | Barone and Della Gatta, 1990 | DH |

Kovats' RI, non-polar column, isothermal

Data compiled by: NIST Mass Spectrometry Data Center, William E. Wallace, director

Column type CapillaryCapillary
Active phase SPB-1SPB-1
Column length (m) 25.25.
Carrier gas  N2
Substrate
Column diameter (mm) 0.250.25
Phase thickness (μm) 0.250.25
Temperature (C) 200.200.
I 2152.2152.
ReferenceSanz, Sanz, et al., 2004Sanz, Villamiel, et al., 2004
Comment MSDC-RI MSDC-RI

References

Lian, Chen, et al., 1982
Lian, Y.N.; Chen, A.T.; Suurkuusk, J.; Wadsoe, I.,
Polyol-water interactions as reflected by aqueous heat capacity values,
Acta Chem. Scand., 1982, A36(9), 735-739. [all data]
Barone, DellaGatta, et al., 1990
Barone, G.; DellaGatta, G.; Ferro, D.; Piacente, V.,
Enthalpies and entropies of sublimation, vaporization and fusion of nine polyhydric alcohols,
J. Chem. Soc., Faraday Trans., 1990, 86, 75. [all data]
Barone, Gatta, et al., 1990
Barone, Guido; Gatta, Giuseppe Della; Ferro, Daniela; Piacente, Vincenzo,
Enthalpies and entropies of sublimation, vaporization and fusion of nine polyhydric alcohols,
Faraday Trans., 1990, 86, 1, 75, https://doi.org/10.1039/ft9908600075
. [all data]
Chen, Oja, et al., 2006
Chen, Xu; Oja, Vahur; Chan, W. Geoffrey; Hajaligol, Mohammad R.,
Vapor Pressure Characterization of Several Phenolics and Polyhydric Compounds by Knudsen Effusion Method,
J. Chem. Eng. Data, 2006, 51, 2, 386-391, https://doi.org/10.1021/je050293h
. [all data]
de Wit, 1983
de Wit, H.G.M.,
Vapor pressures and lattice energies of oxalic acid, mesotartaric acid, phloroglucinol, myoinositol, and their hydrates,
J. Chem. Phys., 1983, 78, 3, 1470, https://doi.org/10.1063/1.444836
. [all data]
Barone and Della Gatta, 1990
Barone, G.; Della Gatta, G.,
Ferro D., and Piacente, V., Enthalpies and entropies of sublimation, vaporization and fusion of nine polyhydric alcohols, J. Chem. Soc.,
Faraday Trans., 1990, 86(1), 75-79. [all data]
Domalski and Hearing, 1996
Domalski, Eugene S.; Hearing, Elizabeth D.,
Heat Capacities and Entropies of Organic Compounds in the Condensed Phase. Volume III,
J. Phys. Chem. Ref. Data, 1996, 25, 1, 1, https://doi.org/10.1063/1.555985
. [all data]