Phenol, pentachloro-
- Formula: C6HCl5O
- Molecular weight: 266.337
- IUPAC Standard InChIKey: IZUPBVBPLAPZRR-UHFFFAOYSA-N
- CAS Registry Number: 87-86-5
- Chemical structure:
View 3d structure (requires JavaScript / HTML 5) - Other names: Dowicide 7; EP 30; Fungifen; Grundier Arbezol; Lauxtol; Liroprem; Penchlorol; Penta; Pentachlorophenol; Permasan; PCP; PCP (Pesticide); Santophen 20; Chem-Tol; Chlorophen; Durotox; Glazd penta; Lauxtol A; NCI-C54933; NCI-C55378; Penta-Kil; Pentachlorphenol; Pentaclorofenolo; Pentacon; Penwar; Peratox; Permacide; Permagard; Permite; Preventol P; Santophen; Sinituho; Term-i-trol; Thompson's wood fix; Weedone; 1-Hydroxy-2,3,4,5,6-pentachlorobenzene; 2,3,4,5,6-Pentachlorophenol; Acutox; Chem-penta; Dowcide 7; Dowicide ec-7; Dow pentachlorophenol dp-2 antimicrobial; NCI-C56655; Pentachlorofenol; Pentachlorophenol, dp-2; Penta ready; Penta wr; Permatox penta; Priltox; RCRA Waste number U242; Witophen P; Chlon; PKhF; Woodtreat A; Pol Nu; Dura Treet II; 1-Hydroxypentachlorobenzene; Satophen; Phenol, 2,3,4,5,6-pentachloro-; Penton 70; Perchlorophenol; Chlorophenasic acid; Dowicide G; Pkhfn; Preventol PN; Santobrite; 39390-77-7

Condensed phase thermochemistry data

Data compiled as indicated in comments:
ALS - Hussein Y. Afeefy, Joel F. Liebman, and Stephen E. Stein
DH - Eugene S. Domalski and Elizabeth D. Hearing
Quantity | Value | Units | Method | Reference | Comment |
---|---|---|---|---|---|
ΔfH°solid | -292.5 ± 3.0 | kJ/mol | Ccb | Sinke and Stull, 1958 | Reanalyzed by Cox and Pilcher, 1970, Original value = -295. ± 3. kJ/mol; ALS |
Quantity | Value | Units | Method | Reference | Comment |
ΔcH°solid | -2329.7 ± 2.9 | kJ/mol | Ccb | Sinke and Stull, 1958 | Reanalyzed by Cox and Pilcher, 1970, Original value = -2328.4 kJ/mol; ALS |
Quantity | Value | Units | Method | Reference | Comment |
S°solid,1 bar | 253.17 | J/mol*K | N/A | Hildenbrand, Kramer, et al., 1958 | DH |
Constant pressure heat capacity of solid
Cp,solid (J/mol*K) | Temperature (K) | Reference | Comment |
---|---|---|---|
201.96 | 298.15 | Hildenbrand, Kramer, et al., 1958 | T = 15 to 300 K.; DH |

Phase change data

Data compiled as indicated in comments:
BS - Robert L. Brown and Stephen E. Stein
TRC - Thermodynamics Research Center, NIST Boulder Laboratories, Chris Muzny director
AC - William E. Acree, Jr., James S. Chickos
Quantity | Value | Units | Method | Reference | Comment |
---|---|---|---|---|---|
Tboil | 583.2 | K | N/A | Aldrich Chemical Company Inc., 1990 | BS |
Quantity | Value | Units | Method | Reference | Comment |
Tfus | 463.84 | K | N/A | Donnelly, Drewes, et al., 1990 | Uncertainty assigned by TRC = 0.2 K; TRC |
Tfus | 462.5 | K | N/A | Plato and Glasgow, 1969 | Uncertainty assigned by TRC = 0.1 K; TRC |
Tfus | 462.8 | K | N/A | McDonald, Shrader, et al., 1959 | Uncertainty assigned by TRC = 0.1 K; TRC |
Quantity | Value | Units | Method | Reference | Comment |
ΔsubH° | 91.6 ± 0.5 | kJ/mol | GS | Verevkin, Emel'yanenko, et al., 2007 | Based on data from 348. to 403. K.; AC |
Enthalpy of vaporization
ΔvapH (kJ/mol) | Temperature (K) | Method | Reference | Comment |
---|---|---|---|---|
69.0 | 478. | A | Stephenson and Malanowski, 1987 | Based on data from 463. to 507. K. See also Dykyj, 1972.; AC |
Enthalpy of fusion
ΔfusH (kJ/mol) | Temperature (K) | Reference | Comment |
---|---|---|---|
17.15 | 462.5 | Acree, 1991 | See also Wójcik, Toupet, et al., 1995.; AC |

Henry's Law data

Data compiled by: Rolf Sander
Henry's Law constant (water solution)
kH(T) = k°H exp(d(ln(kH))/d(1/T) ((1/T) - 1/(298.15 K)))
k°H = Henry's law constant for solubility in water at 298.15 K (mol/(kg*bar))
d(ln(kH))/d(1/T) = Temperature dependence constant (K)
k°H (mol/(kg*bar)) | d(ln(kH))/d(1/T) (K) | Method | Reference |
---|---|---|---|
40000. | X | N/A | |
11. | 1300. | X | N/A |

Kovats' RI, non-polar column, isothermal

Column type | Active phase | Temperature (C) | I | Reference | Comment |
---|---|---|---|---|---|
Capillary | OV-1 | 190. | 1752. | Erdmann, Rochholz, et al., 1992 | |
Capillary | OV-1 | 220. | 1775. | Erdmann, Rochholz, et al., 1992 | |
Capillary | SE-30 | 160. | 1720. | Evans and Haken, 1989 | Column length: 25. m; Column diameter: 0.32 mm |
Capillary | SE-30 | 160. | 1720. | Korhonen, 1984 | |
Capillary | SE-30 | 180. | 1743. | Korhonen, 1984 |

Kovats' RI, polar column, isothermal

Column type | Active phase | Temperature (C) | I | Reference | Comment |
---|---|---|---|---|---|
Capillary | FFAP | 160. | 2821. | Evans and Haken, 1989 | Column length: 25. m; Column diameter: 0.35 mm |
Capillary | FFAP | 160. | 2821. | Korhonen, 1984 | |
Capillary | FFAP | 180. | 2848. | Korhonen, 1984 | |
Capillary | FFAP | 200. | 2885. | Korhonen, 1984 |

Van Den Dool and Kratz RI, non-polar column, temperature ramp

Column type | Active phase | I | Reference | Comment |
---|---|---|---|---|
Capillary | OV-1 | 1731.3 | Gautzsch and Zinn, 1996 | 8. K/min; Tstart: 35. C; Tend: 300. C |
Capillary | DB-5 | 1772. | Rostad and Pereira, 1986 | 30. m/0.26 mm/0.25 μm, He, 50. C @ 4. min, 6. K/min, 300. C @ 20. min |
Capillary | SE-54 | 1726. | Weber, 1986 | 25. m/0.31 mm/0.17 μm, H2, 2. K/min; Tstart: 35. C |
Capillary | SE-54 | 1754. | Weber, 1986 | 25. m/0.31 mm/0.17 μm, H2, 2. K/min; Tstart: 35. C |
Capillary | SE-30 | 1762. | Korhonen, 1984 | 10. K/min; Tstart: 100. C |
Capillary | SE-30 | 1719. | Korhonen, 1984 | 2. K/min; Tstart: 100. C |
Capillary | SE-30 | 1753. | Korhonen, 1984 | 6. K/min; Tstart: 100. C |

Van Den Dool and Kratz RI, polar column, temperature ramp

Column type | Active phase | I | Reference | Comment |
---|---|---|---|---|
Capillary | FFAP | 2855. | Korhonen, 1984 | 2. K/min; Tstart: 100. C |

Normal alkane RI, non-polar column, temperature ramp

Column type | Active phase | I | Reference | Comment |
---|---|---|---|---|
Capillary | HP-5 | 1748. | Zenkevich, Moeder, et al., 2004 | 30. m/0.25 mm/0.25 μm, Helium, 50. C @ 3. min, 3. K/min, 280. C @ 20. min |
Capillary | SE-54 | 1748. | Harland, Cumming, et al., 1986 | He, 50. C @ 2. min, 8. K/min, 250. C @ 12. min; Column length: 25. m; Column diameter: 0.32 mm |

Normal alkane RI, non-polar column, custom temperature program

Column type | Active phase | I | Reference | Comment |
---|---|---|---|---|
Capillary | Methyl Silicone | 1700. | Yu and Zazhi, 2005 | Program: not specified |
Capillary | Polydimethyl siloxane, unknown content of Ph-groups | 1772. | Geldon, 1989 | Program: not specified |
Capillary | Polydimethyl siloxane, unknown content of Ph-groups | 1772. | Geldon, 1989 | Program: not specified |
Capillary | OV-1 | 1715. | Waggott and Davies, 1984 | Hydrogen; Column length: 50. m; Column diameter: 0.32 mm; Program: not specified |
Capillary | OV-1, SE-30, Methyl silicone, SP-2100, OV-101, DB-1, etc. | 1715. | Waggott and Davies, 1984 | Hydrogen; Column length: 50. m; Column diameter: 0.32 mm; Program: not specified |
Other | Methyl Silicone | 1749. | Ardrey and Moffat, 1981 | Program: not specified |

Lee's RI, non-polar column, temperature ramp

Column type | Active phase | I | Reference | Comment |
---|---|---|---|---|
Capillary | DB-5 | 295.8 | Donnelly, Abdel-Hamid, et al., 1993 | 30. m/0.32 mm/0.25 μm, He, 40. C @ 3. min, 8. K/min, 285. C @ 29.5 min |
Capillary | DB-5 | 296.78 | Rostad and Pereira, 1986 | 30. m/0.26 mm/0.25 μm, He, 50. C @ 4. min, 6. K/min, 300. C @ 20. min |
Capillary | DB-5 | 331.1 | Viau, Studak, et al., 1984 | Helium, 4. K/min; Column length: 30. m; Column diameter: 0.32 mm; Tstart: 90. C; Tend: 250. C |

References

Sinke and Stull, 1958
Sinke, G.C.; Stull, D.R.,
Heats of combustion of some organic compounds containing chlorine,
J. Phys. Chem., 1958, 62, 397-401. [all data]
Cox and Pilcher, 1970
Cox, J.D.; Pilcher, G.,
Thermochemistry of Organic and Organometallic Compounds, Academic Press, New York, 1970, 1-636. [all data]
Hildenbrand, Kramer, et al., 1958
Hildenbrand, D.L.; Kramer, W.R.; Stull, D.R.,
The heat capacities of hexachlorobenzene and pentachlorophenol from 15 to 300K,
J. Phys. Chem., 1958, 62, 958-959. [all data]
Aldrich Chemical Company Inc., 1990
Aldrich Chemical Company Inc.,
Catalog Handbook of Fine Chemicals, Aldrich Chemical Company, Inc., Milwaukee WI, 1990, 1. [all data]
Donnelly, Drewes, et al., 1990
Donnelly, J.R.; Drewes, L.A.; Johnson, R.L.; Munslow, W.D.; Knapp, K.K.; Sovocool, G.W.,
Purity and heat of fusion data for environmental standards as determined by differential scanning calorimetry,
Thermochim. Acta, 1990, 167, 2, 155, https://doi.org/10.1016/0040-6031(90)80476-F
. [all data]
Plato and Glasgow, 1969
Plato, C.; Glasgow, A.R., Jr.,
Differential scanning calorimetry as a general method for determining the purity and heat of fusion of high-purity organic chemicals. Application to 95 compounds,
Anal. Chem., 1969, 41, 2, 330, https://doi.org/10.1021/ac60271a041
. [all data]
McDonald, Shrader, et al., 1959
McDonald, R.A.; Shrader, S.A.; Stull, D.R.,
Vapor Pressures and Freezing Points of 30 Organics,
J. Chem. Eng. Data, 1959, 4, 311. [all data]
Verevkin, Emel'yanenko, et al., 2007
Verevkin, Sergey P.; Emel'yanenko, Vladimir N.; Klamt, Andreas,
Thermochemistry of Chlorobenzenes and Chlorophenols: Ambient Temperature Vapor Pressures and Enthalpies of Phase Transitions,
J. Chem. Eng. Data, 2007, 52, 2, 499-510, https://doi.org/10.1021/je060429r
. [all data]
Stephenson and Malanowski, 1987
Stephenson, Richard M.; Malanowski, Stanislaw,
Handbook of the Thermodynamics of Organic Compounds, 1987, https://doi.org/10.1007/978-94-009-3173-2
. [all data]
Dykyj, 1972
Dykyj, J.,
Petrochemia, 1972, 12, 1, 13. [all data]
Acree, 1991
Acree, William E.,
Thermodynamic properties of organic compounds: enthalpy of fusion and melting point temperature compilation,
Thermochimica Acta, 1991, 189, 1, 37-56, https://doi.org/10.1016/0040-6031(91)87098-H
. [all data]
Wójcik, Toupet, et al., 1995
Wójcik, G.; Toupet, L.; Gors, C.; Foulon, M.,
Crystal Structures, Phase Transitions, and Hydrogen Bondings in Pentabromophenol, Pentachlorophenol, and Their Mixed Crystals,
Phys. Stat. Sol. (a), 1995, 147, 1, 99-109, https://doi.org/10.1002/pssa.2211470111
. [all data]