Benzene, hexabromo-
- Formula: C6Br6
- Molecular weight: 551.488
- IUPAC Standard InChIKey: CAYGQBVSOZLICD-UHFFFAOYSA-N
- CAS Registry Number: 87-82-1
- Chemical structure:

Phase change data

Data compiled by: William E. Acree, Jr., James S. Chickos
Enthalpy of fusion
ΔfusH (kJ/mol) | Temperature (K) | Reference |
---|---|---|
24.6 | 598.8 | Kuramochi, Maeda, et al., 2004 |

References

Kuramochi, Maeda, et al., 2004
Kuramochi, Hidetoshi; Maeda, Kouji; Kawamoto, Katsuya,
Measurements of Water Solubilities and 1-Octanol/Water Partition Coefficients and Estimations of Henry's Law Constants for Brominated Benzenes,
J. Chem. Eng. Data, 2004, 49, 3, 720-724, https://doi.org/10.1021/je0342724
. [all data]