4-Acetoxybenzaldehyde
- Formula: C9H8O3
- Molecular weight: 164.1580
- IUPAC Standard InChIKey: SEVSMVUOKAMPDO-UHFFFAOYSA-N
- CAS Registry Number: 878-00-2
- Chemical structure:
View 3d structure (requires JavaScript / HTML 5) - Other names: p-Acetoxybenzaldehyde; Benzaldehyde, 4-(acetyloxy)-; p-Hydroxybenzaldehyde acetate; Benzaldehyde, p-hydroxy-, acetate; 4-formylphenyl acetate

Phase change data

Data compiled by: Robert L. Brown and Stephen E. Stein
Reduced pressure boiling point
Tboil (K) | Pressure (bar) | Reference |
---|---|---|
425.7 | 0.023 | Aldrich Chemical Company Inc., 1990 |
443. to 445. | 0.047 | Frinton Laboratories Inc., 1986 |

Van Den Dool and Kratz RI, non-polar column, temperature ramp

Column type | Active phase | I | Reference | Comment |
---|---|---|---|---|
Capillary | DB-1 | 1294. | Johnson, Urso, et al., 1997 | 30. m/0.2 mm/0.25 μm, 50. C @ 2. min, 5. K/min, 300. C @ 5. min |

Lee's RI, non-polar column, temperature ramp

Column type | Active phase | I | Reference | Comment |
---|---|---|---|---|
Capillary | DB-1 | 228.4 | Johnson, Urso, et al., 1997 | 30. m/0.2 mm/0.25 μm, 50. C @ 2. min, 5. K/min, 300. C @ 5. min |

References

Aldrich Chemical Company Inc., 1990
Aldrich Chemical Company Inc.,
Catalog Handbook of Fine Chemicals, Aldrich Chemical Company, Inc., Milwaukee WI, 1990, 1. [all data]
Frinton Laboratories Inc., 1986
Frinton Laboratories Inc.,
Catalog Number 11, Frinton Laboratories Inc., Vineland, NJ, 1986, 99. [all data]
Johnson, Urso, et al., 1997
Johnson, C.I.; Urso, A.; Geleta, L.,
Broad spectrum analysis of municipal and industrial effluents discharged into the Peace, Athabasca and Slave river basins: characterization of effluent samples, 1994 - Volume 1 of 2, Northern River Basins Study Project Report No. 121, Norther River Basins Study, Edmonton, Alberta, 1997, 27. [all data]