1,3,5-Triazine, 2,4,6-trimethoxy-
- Formula: C6H9N3O3
- Molecular weight: 171.1540
- IUPAC Standard InChIKey: DFUGJTBMQKRCPI-UHFFFAOYSA-N
- CAS Registry Number: 877-89-4
- Chemical structure:
View 3d structure (requires JavaScript / HTML 5) - Other names: s-Triazine, 2,4,6-trimethoxy-; Trimethyl cyanurate; 2,4,6-Trimethoxy-s-triazine; 2,4,6-Trimethoxy-1,3,5-triazine; 2,4,6-Trimethoxy-[1,3,5]-triazin

Gas phase thermochemistry data

Data compiled as indicated in comments:
ALS - Hussein Y. Afeefy, Joel F. Liebman, and Stephen E. Stein
Quantity | Value | Units | Method | Reference | Comment |
---|---|---|---|---|---|
ΔfH°gas | -293. | kJ/mol | Semi | Stewart, 2004 | |
ΔfH°gas | -387.9 ± 1.5 | kJ/mol | Ccr | Imamura, Takahashi, et al., 1989 | ALS |

Condensed phase thermochemistry data

Data compiled as indicated in comments:
ALS - Hussein Y. Afeefy, Joel F. Liebman, and Stephen E. Stein
DH - Eugene S. Domalski and Elizabeth D. Hearing
Quantity | Value | Units | Method | Reference | Comment |
---|---|---|---|---|---|
ΔfH°solid | -478.3 ± 1.2 | kJ/mol | Ccr | Imamura, Takahashi, et al., 1989 | ALS |
ΔfH°solid | -478.6 ± 0.87 | kJ/mol | Ccr | Johnson and Prosen, 1985 | ALS |
Quantity | Value | Units | Method | Reference | Comment |
ΔcH°solid | -3169.04 ± 0.82 | kJ/mol | Ccr | Imamura, Takahashi, et al., 1989 | ALS |
ΔcH°solid | -3168.69 ± 0.83 | kJ/mol | Ccr | Johnson and Prosen, 1985 | ALS |
Constant pressure heat capacity of solid
Cp,solid (J/mol*K) | Temperature (K) | Reference | Comment |
---|---|---|---|
207. | 298.15 | Imamura, Takahashi, et al., 1989 | One temperature, estimated.; DH |

Phase change data

Data compiled as indicated in comments:
ALS - Hussein Y. Afeefy, Joel F. Liebman, and Stephen E. Stein
AC - William E. Acree, Jr., James S. Chickos
DH - Eugene S. Domalski and Elizabeth D. Hearing
Quantity | Value | Units | Method | Reference | Comment |
---|---|---|---|---|---|
ΔsubH° | 90.33 ± 0.94 | kJ/mol | C | Imamura, Takahashi, et al., 1989 | ALS |
ΔsubH° | 88.2 ± 1.3 | kJ/mol | C | Imamura, Takahashi, et al., 1989 | See also Murata, Sakiyama, et al., 1985.; AC |
ΔsubH° | 90.3 ± 1.0 | kJ/mol | C | Imamura, Takahashi, et al., 1989 | See also Murata, Sakiyama, et al., 1985.; AC |
ΔsubH° | 88.2 ± 1.3 | kJ/mol | C | Imamura, Murata, et al., 1988 | AC |
Enthalpy of sublimation
ΔsubH (kJ/mol) | Temperature (K) | Method | Reference | Comment |
---|---|---|---|---|
90.330 | 298.15 | N/A | Imamura, Takahashi, et al., 1989 | DH |
86.6 ± 1.3 | 338. | C | Imamura, Murata, et al., 1988 | Based on data from 330. to 346. K.; AC |
Entropy of sublimation
ΔsubS (J/mol*K) | Temperature (K) | Reference | Comment |
---|---|---|---|
303.0 | 298.15 | Imamura, Takahashi, et al., 1989 | DH |
Enthalpy of fusion
ΔfusH (kJ/mol) | Temperature (K) | Method | Reference | Comment |
---|---|---|---|---|
18.1 | 395.2 | DSC | Handelsman-Benory, Botoshansky, et al., 2000 | Based on data from 298. to 523. K.; AC |

References

Stewart, 2004
Stewart, J.J.P.,
Comparison of the accuracy of semiempirical and some DFT methods for predicting heats of formation,
J. Mol. Model, 2004, 10, 1, 6-10, https://doi.org/10.1007/s00894-003-0157-6
. [all data]
Imamura, Takahashi, et al., 1989
Imamura, A.; Takahashi, K.; Murata, S.; Sakiyama, M.,
Standard enthalpies of formation of trimethyl cyanurate, malonamide, and 1,3-dimethyluracil,
J. Chem. Thermodyn., 1989, 21, 237-246. [all data]
Johnson and Prosen, 1985
Johnson, W.H.; Prosen, E.J.,
Determination of the enthalpies of combustion and formation of substituted triazines in an adiabatic rotating bomb calorimeter,
J. Res. NBS, 1985, 90, 295-303. [all data]
Murata, Sakiyama, et al., 1985
Murata, S.; Sakiyama, M.; Seki, S.,
Sublimation calorimetric studies using a calvet microcalorimeter,
Thermochimica Acta, 1985, 88, 1, 121-126, https://doi.org/10.1016/0040-6031(85)85419-8
. [all data]
Imamura, Murata, et al., 1988
Imamura, A.; Murata, S.; Sakiyama, M.,
Combustion and sublimation calorimetric studies on acetylurea and trimethyl isocyanurate,
J. Chem. Thermodyn., 1988, 20, 389-396. [all data]
Handelsman-Benory, Botoshansky, et al., 2000
Handelsman-Benory, Eidit; Botoshansky, Mark; Greenberg, Mark; Shteiman, Vitaly; Kaftory, Menahem,
Methyl Rearrangement of Methoxy-Triazines in the Solid- and Liquid-State,
Tetrahedron, 2000, 56, 36, 6887-6897, https://doi.org/10.1016/S0040-4020(00)00510-X
. [all data]