7-Norbornadienyl t-butyl ether
- Formula: C11H16O
- Molecular weight: 164.2441
- IUPAC Standard InChIKey: PTTSCAGWOHYHDN-UHFFFAOYSA-N
- CAS Registry Number: 877-06-5
- Chemical structure:
View 3d structure (requires JavaScript / HTML 5) - Other names: 7-tert-Butoxynorbornadiene; Bicyclo[2.2.1]hepta-2,5-diene, 7-(1,1-dimethylethoxy)-; 7-Norbornadadienyl t-butyl ether; 7-tert-butoxybicyclo[2.2.1]hepta-2,5-diene

Phase change data

Data compiled by: Robert L. Brown and Stephen E. Stein
Reduced pressure boiling point
Tboil (K) | Pressure (bar) | Reference |
---|---|---|
343. to 345. | 0.019 | Frinton Laboratories Inc., 1986 |

References

Frinton Laboratories Inc., 1986
Frinton Laboratories Inc.,
Catalog Number 11, Frinton Laboratories Inc., Vineland, NJ, 1986, 99. [all data]