(R)-(-)-2-Phenylglycine
- Formula: C8H9NO2
- Molecular weight: 151.1626
- IUPAC Standard InChIKey: ZGUNAGUHMKGQNY-ZETCQYMHSA-N
- CAS Registry Number: 875-74-1
- Chemical structure:
View 3d structure (requires JavaScript / HTML 5) - Stereoisomers:
- Other names: D-(-)-α-Phenylglycine; R(-)-α-Aminophenylacetic acid; D(-)α-Aminophenylacetic acid; D-(-)-Phenylglycine; D-2-Phenylglycine; Benzeneacetic acid, α-amino-, (R)-; Amino(phenyl)acetic acid -, (alphaR)-; d-α-Phenylglycine

Phase change data

Data compiled by: William E. Acree, Jr., James S. Chickos
Quantity | Value | Units | Method | Reference | Comment |
---|---|---|---|---|---|
ΔsubH° | 39.4 ± 1.4 | kcal/mol | C | Sabbah and Skoulika, 1980 |
Enthalpy of sublimation
ΔsubH (kcal/mol) | Temperature (K) | Method | Reference |
---|---|---|---|
35.59 ± 0.53 | 443. | C | Sabbah and Skoulika, 1980 |

References

Sabbah and Skoulika, 1980
Sabbah, R.; Skoulika, S.,
Thermodynamique de composes azotes. Partie VI. Etude thermochimique de la N-phenylglycine et de la D-α-phenylglycine,
Thermochim. Acta, 1980, 36, 179-187. [all data]