1H-Indene, 2,3-dihydro-5-methyl-
- Formula: C10H12
- Molecular weight: 132.2023
- IUPAC Standard InChIKey: RFXBCGVZEJEYGG-UHFFFAOYSA-N
- CAS Registry Number: 874-35-1
- Chemical structure:

Phase change data

Data compiled by: Robert L. Brown and Stephen E. Stein
Reduced pressure boiling point
Tboil (K) | Pressure (bar) | Reference |
---|---|---|
355.2 | 0.023 | Weast and Grasselli, 1989 |

Kovats' RI, non-polar column, isothermal

Data compiled by: NIST Mass Spectrometry Data Center, William E. Wallace, director

Column type CapillaryCapillaryCapillaryCapillaryCapillary
Active phase OV-1CP Sil 2SE-30SqualaneSqualane
Column length (m) 50.100.15.
Carrier gas   N2
Substrate
Column diameter (mm) 0.250.250.25
Phase thickness (μm)  0.25
Temperature (C) 100.80.70.100.92.
I 1136.21138.51112.21121.1119.
ReferenceZhu, Zhang, et al., 1999Estel, Mohnke, et al., 1995Tóth, 1983Bogoslovsky, Anvaer, et al., 1978Bogoslovsky, Anvaer, et al., 1978
Comment MSDC-RI MSDC-RI MSDC-RI MSDC-RI MSDC-RI
Column type Capillary
Active phase Squalane
Column length (m) 50.
Carrier gas H2
Substrate
Column diameter (mm) 0.2
Phase thickness (μm)
Temperature (C) 100.
I 1121.
ReferenceMitra, Mohan, et al., 1974
Comment MSDC-RI

References

Weast and Grasselli, 1989
CRC Handbook of Data on Organic Compounds, 2nd Editon, Weast,R.C and Grasselli, J.G., ed(s)., CRC Press, Inc., Boca Raton, FL, 1989, 1. [all data]
Kusakov, et al., 1963
Kusakov, M.M., et al.,
Ultraviolet Absorption Spectra of Aromatic Hydrocarbons, 1963, 139. [all data]