Di-tert-butyldiazene-N-oxide
- Formula: C8H18N2O
- Molecular weight: 158.2413
- IUPAC Standard InChIKey: YOGGJOULZPUAHF-KTKRTIGZSA-N
- CAS Registry Number: 87339-11-5
- Chemical structure:
View 3d structure (requires JavaScript / HTML 5) - Species with the same structure:

Phase change data

Data compiled by: Eugene S. Domalski and Elizabeth D. Hearing
Enthalpy of vaporization
ΔvapH (kJ/mol) | Temperature (K) | Reference | Comment |
---|---|---|---|
51.702 | 298.15 | Bystrom, 1981 |
Entropy of vaporization
ΔvapS (J/mol*K) | Temperature (K) | Reference | Comment |
---|---|---|---|
173.4 | 298.15 | Bystrom, 1981 |
Temperature of phase transition
Ttrs (K) | Initial Phase | Final Phase | Reference | Comment |
---|---|---|---|---|
288.4 | crystaline, I | liquid | Bystrom, 1981 |

References

Bystrom, 1981
Bystrom, K.,
Enthalpies of combustion, vaporization, and formation for di-n-propyldiazene N-oxide and di-t-butyldiazene N-oxide,
J. Chem. Thermodyn., 1981, 13, 139-145. [all data]