Tetra-sec-butoxy titanium

Phase change data

Data compiled by: William E. Acree, Jr., James S. Chickos

Enthalpy of vaporization

ΔvapH (kJ/mol) Temperature (K) Method Reference Comment
76.8393.AStephenson and Malanowski, 1987Based on data from 378. - 414. K.
67.1385.AStephenson and Malanowski, 1987Based on data from 370. - 476. K.

References

Stephenson and Malanowski, 1987
Stephenson, Richard M.; Malanowski, Stanislaw, Handbook of the Thermodynamics of Organic Compounds, 1987, https://doi.org/10.1007/978-94-009-3173-2 . [all data]