5,5-Dimethyl-1,3-dioxane
- Formula: C6H12O2
- Molecular weight: 116.1583
- IUPAC Standard InChIKey: QDCJIPFNVBDLRH-UHFFFAOYSA-N
- CAS Registry Number: 872-98-0
- Chemical structure:
View 3d structure (requires JavaScript / HTML 5) - Other names: 1,3-Dioxane, 5,5-dimethyl-; m-Dioxane, 5,5-dimethyl-; 5,5-Dimethyl-m-dioxane

Gas phase thermochemistry data

Data compiled as indicated in comments:
DRB - Donald R. Burgess, Jr.
ALS - Hussein Y. Afeefy, Joel F. Liebman, and Stephen E. Stein
Quantity | Value | Units | Method | Reference | Comment |
---|---|---|---|---|---|
ΔfH°gas | -420.3 ± 2.4 | kJ/mol | N/A | Pihlaja and Luoma, 1968 | Value computed using ΔfHliquid° value of -461.3±2.2 kj/mol from Pihlaja and Luoma, 1968 and ΔvapH° value of 41±1 kj/mol from missing citation.; DRB |
ΔfH°gas | -421.2 ± 2.7 | kJ/mol | Ccb | Pihlaja and Heikkila, 1967 | ALS |

Condensed phase thermochemistry data

Data compiled by: Hussein Y. Afeefy, Joel F. Liebman, and Stephen E. Stein
Quantity | Value | Units | Method | Reference | Comment |
---|---|---|---|---|---|
ΔfH°liquid | -461.3 ± 2.2 | kJ/mol | Ccb | Pihlaja and Luoma, 1968 | see Pihlaja and Heikkila, 1967 |
Quantity | Value | Units | Method | Reference | Comment |
ΔcH°liquid | -3614.7 ± 2.2 | kJ/mol | Ccb | Pihlaja and Luoma, 1968 | see Pihlaja and Heikkila, 1967; Corresponding ΔfHºliquid = -461.33 kJ/mol (simple calculation by NIST; no Washburn corrections) |

Phase change data

Data compiled as indicated in comments:
BS - Robert L. Brown and Stephen E. Stein
TRC - Thermodynamics Research Center, NIST Boulder Laboratories, Chris Muzny director
ALS - Hussein Y. Afeefy, Joel F. Liebman, and Stephen E. Stein
Quantity | Value | Units | Method | Reference | Comment |
---|---|---|---|---|---|
Tboil | 397. to 399. | K | N/A | Frinton Laboratories Inc., 1986 | BS |
Tboil | 398.15 | K | N/A | Eliel and Knoeber, 1968 | Uncertainty assigned by TRC = 1.5 K; TRC |
Quantity | Value | Units | Method | Reference | Comment |
ΔvapH° | 41. ± 1. | kJ/mol | V | Pihlaja and Heikkila, 1967 | ALS |

Normal alkane RI, non-polar column, isothermal

Column type | Active phase | Temperature (C) | I | Reference | Comment |
---|---|---|---|---|---|
Packed | Apieson L | 120. | 803. | Kurdina, Markovich, et al., 1969 | not specified, not specified |

References

Pihlaja and Luoma, 1968
Pihlaja, K.; Luoma, S.,
Heats of formation and conformational energies of 1,3-dioxane and its methyl homologues,
Acta Chem. Scand., 1968, 22, 2401-2414. [all data]
Pihlaja and Heikkila, 1967
Pihlaja, K.; Heikkila, J.,
The configurations of isomeric 2,2,4,6-tetramethyl-1,3-dioxanes,
Acta Chem. Scand., 1967, 21, 2430-2434. [all data]
Frinton Laboratories Inc., 1986
Frinton Laboratories Inc.,
Catalog Number 11, Frinton Laboratories Inc., Vineland, NJ, 1986, 99. [all data]
Eliel and Knoeber, 1968
Eliel, E.L.; Knoeber, M.C.,
Conformational Analysis XVI. 1,3-Dioxanes,
J. Am. Chem. Soc., 1968, 90, 3444. [all data]
Kurdina, Markovich, et al., 1969
Kurdina, Z.G.; Markovich, V.E.; Sakharov, V.M.,
Gas chromatography of cyclic O-containing compounds
in Gas chromatography, Issue # 10, NIITEKhim, Moscow, 1969, 128-133. [all data]