Thiophene, tetrahydro-3-methyl-, 1,1-dioxide
- Formula: C5H10O2S
- Molecular weight: 134.197
- IUPAC Standard InChIKey: CMJLMPKFQPJDKP-UHFFFAOYSA-N
- CAS Registry Number: 872-93-5
- Chemical structure:
View 3d structure (requires JavaScript / HTML 5) - Other names: 3-Methylsulfolane; 3-Methyltetrahydrothiophene 1,1-dioxide; 3-Methylthiacyclopentane 1,1-dioxide

Phase change data

Data compiled by: Thermodynamics Research Center, NIST Boulder Laboratories, Chris Muzny director
Quantity | Value | Units | Method | Reference | Comment |
---|---|---|---|---|---|
Tboil | 550. | K | N/A | Lee, 1986 | Uncertainty assigned by TRC = 3. K |
Quantity | Value | Units | Method | Reference | Comment |
Tfus | 305. | K | N/A | Lee, 1986 | Uncertainty assigned by TRC = 0.8 K |

References

Lee, 1986
Lee, F.-M.,
Use of Organic Sulfones as the Extractive Distillation SOlvent for Aromatic Recovery,
Ind. Eng. Chem. Process Des. Dev., 1986, 25, 949-57. [all data]