2-Hydroxyethyl salicylate
- Formula: C9H10O4
- Molecular weight: 182.1733
- IUPAC Standard InChIKey: LVYLCBNXHHHPSB-UHFFFAOYSA-N
- CAS Registry Number: 87-28-5
- Chemical structure:
View 3d structure (requires JavaScript / HTML 5) - Other names: Ethylene glycol, monosalicylate; Benzoic acid, 2-hydroxy-, 2-hydroxyethyl ester; β-Hydroxyethyl salicylate; Espirosal; Ethylene glycol, salicylate; Glycol monosalicylate; Glysal; GL 7; Rheumacyl; Salicylic acid, 2-hydroxyethyl ester; Sarocol; Spirosal; 1,2-Ethylene glycol monosalicylate; 2-Hydroxybenzoic acid 2-hydroxyethyl ester; Glycol salicylate; Monoglycol salicylate; Norgesic; Phlogont; 2-Hydroxyethyl 2-hydroxybenzoate

Phase change data

Data compiled by: Robert L. Brown and Stephen E. Stein
Reduced pressure boiling point
Tboil (K) | Pressure (bar) | Reference |
---|---|---|
439.2 | 0.017 | Aldrich Chemical Company Inc., 1990 |

Van Den Dool and Kratz RI, non-polar column, temperature ramp

Column type | Active phase | I | Reference | Comment |
---|---|---|---|---|
Capillary | VF-5MS | 1558. | Todua, 2011 | 30. m/0.25 mm/0.25 μm, He; Tstart: 60. C; Tend: 270. C |

References

Aldrich Chemical Company Inc., 1990
Aldrich Chemical Company Inc.,
Catalog Handbook of Fine Chemicals, Aldrich Chemical Company, Inc., Milwaukee WI, 1990, 1. [all data]
Todua, 2011
Todua, N.G.,
Retention Data. NIST Mass Spectrometry Data Center., NIST Mass Spectrometry Data Center, 2011. [all data]