Benzoic acid, 2-amino-, ethyl ester
- Formula: C9H11NO2
- Molecular weight: 165.1891
- IUPAC Standard InChIKey: TWLLPUMZVVGILS-UHFFFAOYSA-N
- CAS Registry Number: 87-25-2
- Chemical structure:
View 3d structure (requires JavaScript / HTML 5) - Other names: Anthranilic acid, ethyl ester; o-(Ethoxycarbonyl)aniline; Ethyl anthranilate; Ethyl o-aminobenzoate; Ethyl 2-aminobenzoate; Benzoic acid, o-amino-, ethyl ester; 2-Aminobenzoic acid, ethyl ester

Phase change data

Data compiled as indicated in comments:
BS - Robert L. Brown and Stephen E. Stein
TRC - Thermodynamics Research Center, NIST Boulder Laboratories, Chris Muzny director
AC - William E. Acree, Jr., James S. Chickos
Quantity | Value | Units | Method | Reference | Comment |
---|---|---|---|---|---|
Tboil | 541.2 | K | N/A | Weast and Grasselli, 1989 | BS |
Tboil | 539. to 541. | K | N/A | Buckingham and Donaghy, 1982 | BS |
Quantity | Value | Units | Method | Reference | Comment |
Tfus | 286. | K | N/A | Buckingham and Donaghy, 1982 | BS |
Tfus | 287.5 | K | N/A | Dreisbach, 1955 | Uncertainty assigned by TRC = 0.02 K; TRC |
Reduced pressure boiling point
Tboil (K) | Pressure (atm) | Reference | Comment |
---|---|---|---|
402.7 | 0.01 | Aldrich Chemical Company Inc., 1990 | BS |
419.2 | 0.020 | Weast and Grasselli, 1989 | BS |
418. to 420. | 0.020 | Buckingham and Donaghy, 1982 | BS |
Enthalpy of vaporization
ΔvapH (kcal/mol) | Temperature (K) | Method | Reference | Comment |
---|---|---|---|---|
14.2 | 448. | A | Stephenson and Malanowski, 1987 | Based on data from 433. to 593. K.; AC |

Kovats' RI, non-polar column, temperature ramp

Data compiled by: NIST Mass Spectrometry Data Center, William E. Wallace, director

Column type Capillary
Active phase CP Sil 8 CB
Column length (m) 30.
Carrier gas H2
Substrate
Column diameter (mm) 0.25
Phase thickness (μm) 0.25
Tstart (C) 50.
Tend (C) 220.
Heat rate (K/min) 3.
Initial hold (min) 2.
Final hold (min)
I 1452.
ReferenceTayoub, Schwob, et al., 2006
Comment MSDC-RI

Kovats' RI, non-polar column, isothermal

Data compiled by: NIST Mass Spectrometry Data Center, William E. Wallace, director

Column type Packed
Active phase OV-101
Column length (m)
Carrier gas
Substrate Gas Chrom Q (80-100 mesh)
Column diameter (mm)
Phase thickness (μm)
Temperature (C) 150.
I 1387.
ReferenceDelley and Friedrich, 1977
Comment MSDC-RI

References

Weast and Grasselli, 1989
CRC Handbook of Data on Organic Compounds, 2nd Editon, Weast,R.C and Grasselli, J.G., ed(s)., CRC Press, Inc., Boca Raton, FL, 1989, 1. [all data]
Buckingham and Donaghy, 1982
Buckingham, J.; Donaghy, S.M.,
Dictionary of Organic Compounds: Fifth Edition, Chapman and Hall, New York, 1982, 1. [all data]
Dreisbach, 1955
Dreisbach, R.R.,
Physical Properties of Chemical Compounds, Advances in Chemistry Series No. 15, Am. Chem. Soc.: Washington, D. C., 1955. [all data]
Aldrich Chemical Company Inc., 1990
Aldrich Chemical Company Inc.,
Catalog Handbook of Fine Chemicals, Aldrich Chemical Company, Inc., Milwaukee WI, 1990, 1. [all data]
Stephenson and Malanowski, 1987
Stephenson, Richard M.; Malanowski, Stanislaw,
Handbook of the Thermodynamics of Organic Compounds, 1987, https://doi.org/10.1007/978-94-009-3173-2
. [all data]