5-Chloro-1-methylimidazole
- Formula: C4H5ClN2
- Molecular weight: 116.549
- IUPAC Standard InChIKey: NYDGOZPYEABERA-UHFFFAOYSA-N
- CAS Registry Number: 872-49-1
- Chemical structure:
View 3d structure (requires JavaScript / HTML 5) - Other names: 1H-Imidazole, 5-chloro-1-methyl-; 5-chloro-1-methyl-1H-imidazole

Phase change data

Data compiled by: Robert L. Brown and Stephen E. Stein
Reduced pressure boiling point
Tboil (K) | Pressure (bar) | Reference |
---|---|---|
362. to 363. | 0.019 | Frinton Laboratories Inc., 1986 |

References

Frinton Laboratories Inc., 1986
Frinton Laboratories Inc.,
Catalog Number 11, Frinton Laboratories Inc., Vineland, NJ, 1986, 99. [all data]