Ethyl o-methylbenzoate
- Formula: C10H12O2
- Molecular weight: 164.2011
- IUPAC Standard InChIKey: SOUAXOGPALPTTC-UHFFFAOYSA-N
- CAS Registry Number: 87-24-1
- Chemical structure:
View 3d structure (requires JavaScript / HTML 5) - Other names: Ethyl-2-methylbenzoate; Ethyl o-toluate; o-Toluic acid ethyl ester; Benzoic acid, 2-methyl-, ethyl ester; Ethyl orthotoluate; o-Toluylic acid, ethyl ester

Phase change data

Data compiled as indicated in comments:
BS - Robert L. Brown and Stephen E. Stein
TRC - Thermodynamics Research Center, NIST Boulder Laboratories, Chris Muzny director
Quantity | Value | Units | Method | Reference | Comment |
---|---|---|---|---|---|
Tboil | 500.2 | K | N/A | Weast and Grasselli, 1989 | BS |
Tboil | 500. | K | N/A | Perkin, 1896 | Uncertainty assigned by TRC = 2. K; TRC |
Reduced pressure boiling point
Tboil (K) | Pressure (bar) | Reference | Comment |
---|---|---|---|
493.7 | 0.975 | Aldrich Chemical Company Inc., 1990 | BS |

Van Den Dool and Kratz RI, non-polar column, custom temperature program

Column type | Active phase | I | Reference | Comment |
---|---|---|---|---|
Capillary | 5 % Phenyl methyl siloxane | 1271.5 | Zaikin, 2003 | Column length: 30. m; Column diameter: 0.19 mm; Program: 50 C to 120 C at 5 C/min; 120 C to 290 C at 12 C/min |

References

Weast and Grasselli, 1989
CRC Handbook of Data on Organic Compounds, 2nd Editon, Weast,R.C and Grasselli, J.G., ed(s)., CRC Press, Inc., Boca Raton, FL, 1989, 1. [all data]
Perkin, 1896
Perkin, W.H.,
LXIX. On Magnetic Rotatory Power, especially of Aromatic Compounds,
J. Chem. Soc., 1896, 69, 1025-1257. [all data]
Aldrich Chemical Company Inc., 1990
Aldrich Chemical Company Inc.,
Catalog Handbook of Fine Chemicals, Aldrich Chemical Company, Inc., Milwaukee WI, 1990, 1. [all data]
Zaikin, 2003
Zaikin, V.G.,
Personal Communication: Retention indices measured during the period 2001 to 2003, 2003. [all data]