Pentane, 1,1'-thiobis-
- Formula: C10H22S
- Molecular weight: 174.347
- IUPAC Standard InChIKey: JOZDADPMWLVEJK-UHFFFAOYSA-N
- CAS Registry Number: 872-10-6
- Chemical structure:

Gas phase thermochemistry data

Data compiled by: Hussein Y. Afeefy, Joel F. Liebman, and Stephen E. Stein
Quantity | Value | Units | Method | Reference | Comment |
---|---|---|---|---|---|
ΔfH°gas | -205. ± 3. | kJ/mol | Ccb | Mackle and Mayrick, 1962 |

Condensed phase thermochemistry data

Data compiled by: Hussein Y. Afeefy, Joel F. Liebman, and Stephen E. Stein
Quantity | Value | Units | Method | Reference | Comment |
---|---|---|---|---|---|
ΔfH°liquid | -267. ± 2. | kJ/mol | Ccb | Mackle and Mayrick, 1962 | |
Quantity | Value | Units | Method | Reference | Comment |
ΔcH°liquid | -7415. ± 2. | kJ/mol | Ccb | Mackle and Mayrick, 1962 | |
ΔcH°liquid | -7429.5 | kJ/mol | Ccb | Berthelot, 1901 |

Phase change data

Data compiled as indicated in comments:
BS - Robert L. Brown and Stephen E. Stein
ALS - Hussein Y. Afeefy, Joel F. Liebman, and Stephen E. Stein
DRB - Donald R. Burgess, Jr.
AC - William E. Acree, Jr., James S. Chickos
Quantity | Value | Units | Method | Reference | Comment |
---|---|---|---|---|---|
ΔvapH° | 62. ± 2. | kJ/mol | V | Mackle and Mayrick, 1962 | ALS |
ΔvapH° | 62.0 | kJ/mol | N/A | Mackle and Mayrick, 1962 | DRB |
Reduced pressure boiling point
Tboil (K) | Pressure (bar) | Reference | Comment |
---|---|---|---|
359.2 | 0.005 | Weast and Grasselli, 1989 | BS |
Enthalpy of vaporization
ΔvapH (kJ/mol) | Temperature (K) | Method | Reference | Comment |
---|---|---|---|---|
58.7 | 356. | A | Stephenson and Malanowski, 1987 | Based on data from 346. to 366. K.; AC |
57.5 | 358. | EB | Mackle and Mayrick, 1962, 2 | Based on data from 346. to 366. K.; AC |

Kovats' RI, non-polar column, isothermal

View large format table.

Column type Active phase Temperature (C) I Reference Comment
PackedApiezon M130.1276.Garbuzov, Misharina, et al., 1985He or N2, Chromosorb W, AW-DMCS; Column length: 2.1 m
PackedSE-3080.1266.Zotov, Golovkin, et al., 1981N2, Chromaton N-AWHMDS; Column length: 1.8 m
PackedSE-30190.1303.Golovkin, Smol'chenko, et al., 1980N2, Chromaton N-AW-DMCS; Column length: 1. m
PackedApiezon M130.1276.Golovnya, Garbuzov, et al., 1976N2, Chromosorb W; Column length: 2.1 m
PackedApiezon M130.1277.Golovnya and Garbuzov, 1974N2, Chromosorb W; Column length: 2.1 m
PackedDC-200120.1277.Golovnya and Arsen'ev, 1970Column length: 1.5 m
PackedSE-30130.1276.Golovnya and Arsen'ev, 1970Column length: 1.5 m

Kovats' RI, polar column, isothermal

View large format table.

Column type Active phase Temperature (C) I Reference Comment
CapillaryPEG-20M93.1461.7Morishita, Murakita, et al., 1985Column length: 50. m; Column diameter: 0.25 mm
CapillaryPEG-20M80.1456.3Morishita, Murakita, et al., 1982N2; Column length: 50. m; Column diameter: 0.25 mm
PackedPolyethylene Glycol130.1483.Golovnya, Garbuzov, et al., 1976N2, Chromosorb W; Column length: 2.1 m

Van Den Dool and Kratz RI, non-polar column, temperature ramp

View large format table.

Column type Active phase I Reference Comment
PackedSE-301268.Zotov, Golovkin, et al., 1981N2, Chromaton N-AWHMDS, 3.9 K/min; Column length: 1.8 m; Tstart: 80. C; Tend: 250. C

References

Mackle and Mayrick, 1962
Mackle, H.; Mayrick, R.G.,
Studies in the thermochemistry of organic sulphides. Part 2. The gas-phase heats of formation of ten aliphatic sulphides,
Trans. Faraday Soc., 1962, 58, 230-237. [all data]
Berthelot, 1901
Berthelot, M.,
Chimie Organique. - Nouvelles recherches sur l'isomerie des ethers sulfocyaniques,
Compt. Rend., 1901, 132, 57-58. [all data]
Weast and Grasselli, 1989
CRC Handbook of Data on Organic Compounds, 2nd Editon, Weast,R.C and Grasselli, J.G., ed(s)., CRC Press, Inc., Boca Raton, FL, 1989, 1. [all data]
Stephenson and Malanowski, 1987
Stephenson, Richard M.; Malanowski, Stanislaw,
Handbook of the Thermodynamics of Organic Compounds, 1987, https://doi.org/10.1007/978-94-009-3173-2
. [all data]
Mackle and Mayrick, 1962, 2
Mackle, H.; Mayrick, R.G.,
Studies in the thermochemistry of organic sulphides. Part 2.?The gas-phase heats of formation of ten aliphatic sulphides,
Trans. Faraday Soc., 1962, 58, 230, https://doi.org/10.1039/tf9625800230
. [all data]