1,7-Octadiyne
- Formula: C8H10
- Molecular weight: 106.1650
- IUPAC Standard InChIKey: DSOJWVLXZNRKCS-UHFFFAOYSA-N
- CAS Registry Number: 871-84-1
- Chemical structure:
View 3d structure (requires JavaScript / HTML 5) - Other names: octa-1,7-diyne

Phase change data

Data compiled as indicated in comments:
BS - Robert L. Brown and Stephen E. Stein
TRC - Thermodynamics Research Center, NIST Boulder Laboratories, Chris Muzny director
Quantity | Value | Units | Method | Reference | Comment |
---|---|---|---|---|---|
Tboil | 408. to 409. | K | N/A | Farchan Laboratories, 1990 | BS |
Tboil | 408.7 | K | N/A | Weast and Grasselli, 1989 | BS |
Tboil | 409. | K | N/A | Lespieau and Deluchat, 1926 | Uncertainty assigned by TRC = 4. K; TRC |

Reaction thermochemistry data

Data compiled by: Hussein Y. Afeefy, Joel F. Liebman, and Stephen E. Stein
Individual Reactions
By formula: 4H2 + C8H10 = C8H18
Quantity | Value | Units | Method | Reference | Comment |
---|---|---|---|---|---|
ΔrH° | -584.5 ± 5.0 | kJ/mol | Chyd | Flitcroft, Skinner, et al., 1957 | liquid phase |

Kovats' RI, non-polar column, isothermal

Column type | Active phase | Temperature (C) | I | Reference | Comment |
---|---|---|---|---|---|
Capillary | Squalane | 50. | 769.2 | Welsch, Engewald, et al., 1978 | Column length: 80. m; Column diameter: 0.23 mm |

References

Farchan Laboratories, 1990
Farchan Laboratories,
Research Chemicals Catalog, Farchan Laboratories, Gainesville, FL, 1990, 91. [all data]
Weast and Grasselli, 1989
CRC Handbook of Data on Organic Compounds, 2nd Editon, Weast,R.C and Grasselli, J.G., ed(s)., CRC Press, Inc., Boca Raton, FL, 1989, 1. [all data]
Lespieau and Deluchat, 1926
Lespieau, R.; Deluchat, M.,
C. R. Hebd. Seances Acad. Sci., 1926, 183, 889. [all data]
Flitcroft, Skinner, et al., 1957
Flitcroft, T.; Skinner, H.A.; Whiting, M.C.,
Heats of hydrogenation Part 1.-Dodeca-3:9 and -5:7 Diynes,
Trans. Faraday Soc., 1957, 53, 784-790. [all data]
Welsch, Engewald, et al., 1978
Welsch, Th.; Engewald, W.; Berger, P.,
IX. Das gas-chromatographische Retentionsverhalten isomerer Octine and Octadiine,
Chromatographia, 1978, 11, 1, 5-9, https://doi.org/10.1007/BF02262945
. [all data]