Salicylanilide
- Formula: C13H11NO2
- Molecular weight: 213.2319
- IUPAC Standard InChIKey: WKEDVNSFRWHDNR-UHFFFAOYSA-N
- CAS Registry Number: 87-17-2
- Chemical structure:
View 3d structure (requires JavaScript / HTML 5) - Other names: Benzamide, 2-hydroxy-N-phenyl-; Ansadol; Aseptolan; ASK; Hyanilid; N-Phenylsalicylamide; Salicylanilid; Salicylic acid anilide; Salifebrin; Salinide; Salinidol; Salnide; Sherstat SLN; Shirlan; Shirlan AG; Shirlan Extra; Anilid kyseliny salicylove; o-Hydroxybenzanilide; 2-Hydroxy-N-phenylbenzamide; 2-Hydroxybenzanilide; NSC 14881; WR 10019

Condensed phase thermochemistry data

Data compiled by: Hussein Y. Afeefy, Joel F. Liebman, and Stephen E. Stein
Quantity | Value | Units | Method | Reference | Comment |
---|---|---|---|---|---|
ΔfH°solid | -308.2 ± 3.0 | kJ/mol | Ccb | Ryskalieva, Abramova, et al., 1992 | |
Quantity | Value | Units | Method | Reference | Comment |
ΔcH°solid | -6379.6 ± 3.0 | kJ/mol | Ccb | Ryskalieva, Abramova, et al., 1992 |

References

Ryskalieva, Abramova, et al., 1992
Ryskalieva, A.K.; Abramova, G.V.; Erkasov, R.Sh.; Nurakhmetov, N.N.,
Enthalpies of combustion and formation of salicylic acid derivatives,
Russ. J. Phys. Chem. (Engl. Transl.), 1992, 66, 421-423, In original 797. [all data]
Tosi, 1968
Tosi, C.,
Spectrochim. Acta, 1968, 24 A, 743. [all data]