CH3CH2NNN
- Formula: C2H5N3
- Molecular weight: 71.0812
- IUPAC Standard InChIKey: UCSVJZQSZZAKLD-UHFFFAOYSA-N
- CAS Registry Number: 871-31-8
- Chemical structure:
View 3d structure (requires JavaScript / HTML 5) - Permanent link for this species. Use this link for bookmarking this species for future reference.

Phase change data

Data compiled by: William E. Acree, Jr., James S. Chickos
Enthalpy of vaporization
ΔvapH (kJ/mol) | Temperature (K) | Method | Reference | Comment |
---|---|---|---|---|
31.5 | 308. | A | Stephenson and Malanowski, 1987 | Based on data from 296. to 320. K. See also Dykyj, 1970. |
28.9 | 268. | A | Stephenson and Malanowski, 1987 | Based on data from 253. to 298. K. See also Geiseler and Konig, 1964 and Boublik, Fried, et al., 1984. |

Gas phase ion energetics data

Data evaluated by: Edward P. Hunter and Sharon G. Lias
Quantity | Value | Units | Method | Reference | Comment |
---|---|---|---|---|---|
Proton affinity (review) | 878. | kJ/mol | N/A | Hunter and Lias, 1998 | |
Quantity | Value | Units | Method | Reference | Comment |
Gas basicity | 845.5 | kJ/mol | N/A | Hunter and Lias, 1998 |

References

Stephenson and Malanowski, 1987
Stephenson, Richard M.; Malanowski, Stanislaw,
Handbook of the Thermodynamics of Organic Compounds, 1987, https://doi.org/10.1007/978-94-009-3173-2
. [all data]
Dykyj, 1970
Dykyj, J.,
Petrochemica, 1970, 10, 2, 51. [all data]
Geiseler and Konig, 1964
Geiseler, G.; Konig, W.,
Z. Phys. Chem. (Leipzig), 1964, 227, 81. [all data]
Boublik, Fried, et al., 1984
Boublik, T.; Fried, V.; Hala, E.,
The Vapour Pressures of Pure Substances: Selected Values of the Temperature Dependence of the Vapour Pressures of Some Pure Substances in the Normal and Low Pressure Region, 2nd ed., Elsevier, New York, 1984, 972. [all data]
Hunter and Lias, 1998
Hunter, E.P.; Lias, S.G.,
Evaluated Gas Phase Basicities and Proton Affinities of Molecules: An Update,
J. Phys. Chem. Ref. Data, 1998, 27, 3, 413-656, https://doi.org/10.1063/1.556018
. [all data]