4-penten-1-yne
- Formula: C5H6
- Molecular weight: 66.1011
- IUPAC Standard InChIKey: LKOBTUTURSPCEE-UHFFFAOYSA-N
- CAS Registry Number: 871-28-3
- Chemical structure:
View 3d structure (requires JavaScript / HTML 5) - Permanent link for this species. Use this link for bookmarking this species for future reference.

Phase change data

Data compiled by: Thermodynamics Research Center, NIST Boulder Laboratories, Chris Muzny director
Quantity | Value | Units | Method | Reference | Comment |
---|---|---|---|---|---|
Tboil | 315. | K | N/A | Labarre, 1963 | Uncertainty assigned by TRC = 1.5 K |
Tboil | 316. | K | N/A | Petrov, Kolesova, et al., 1957 | Uncertainty assigned by TRC = 2. K |

References

Labarre, 1963
Labarre, J.F.,
Contribution to the Study of Magneto-Optics of Bonds Between Atoms in Aliphatic Hydrocarbons,
Ann. Chim., 1963, 8, 45-83. [all data]
Petrov, Kolesova, et al., 1957
Petrov, A.A.; Kolesova, V.A.; Porfir'eva, Y.I.,
Conjugated Systems. LXXVIII Raman Spectra and Reactivity of Vinylacetylenic Hydrocarbons,
Zh. Obshch. Khim., 1957, 27, 2081-7. [all data]