diethylhydridoaluminium
- Formula: C4H11Al
- Molecular weight: 86.1117
- CAS Registry Number: 871-27-2

Gas phase thermochemistry data

Data compiled by: José A. Martinho Simões
Quantity | Value | Units | Method | Reference | Comment |
---|---|---|---|---|---|
ΔfH°gas | -146.5 ± 7.1 | kJ/mol | Review | Martinho Simões | Selected data |
ΔfH°gas | -250. ± 19. | kJ/mol | Review | Martinho Simões |

Condensed phase thermochemistry data

Data compiled by: José A. Martinho Simões
Quantity | Value | Units | Method | Reference | Comment |
---|---|---|---|---|---|
ΔfH°liquid | -204.2 ± 6.8 | kJ/mol | Review | Martinho Simões | Selected data |
ΔfH°liquid | -308. ± 18. | kJ/mol | Review | Martinho Simões | |
Quantity | Value | Units | Method | Reference | Comment |
ΔcH°liquid | -3779.8 ± 6.7 | kJ/mol | CC-SB | Pawlenko, 1967 | Please also see Pedley and Rylance, 1977 and Cox and Pilcher, 1970. |
ΔcH°liquid | -3677. ± 18. | kJ/mol | CC-SB | Shaulov, Shmyreva, et al., 1965 | Please also see Cox and Pilcher, 1970. |

Phase change data

Data compiled by: José A. Martinho Simões
Quantity | Value | Units | Method | Reference | Comment |
---|---|---|---|---|---|
ΔvapH° | 57.7 ± 2.1 | kJ/mol | CC-SB | Shaulov, Shmyreva, et al., 1965 | Please also see Cox and Pilcher, 1970. |

References

Martinho Simões
Martinho Simões, J.A.,
Private communication (see http://webbook.nist.gov/chemistry/om/). [all data]
Pawlenko, 1967
Pawlenko, S.,
Chem. Ber., 1967, 100, 3591. [all data]
Pedley and Rylance, 1977
Pedley, J.B.; Rylance, J.,
Computer Analysed Thermochemical Data: Organic and Organometallic Compounds, University of Sussex, Brigton, 1977. [all data]
Cox and Pilcher, 1970
Cox, J.D.; Pilcher, G.,
Thermochemistry of Organic and Organometallic Compounds
in Academic Press, New York, 1970. [all data]
Shaulov, Shmyreva, et al., 1965
Shaulov, Yu.Kh.; Shmyreva, G.O.; Tubyanskaya, V.S.,
Russ. J. Phys. Chem., 1965, 39, 51. [all data]