Quinoline, 4,7-dichloro-
- Formula: C9H5Cl2N
- Molecular weight: 198.049
- IUPAC Standard InChIKey: HXEWMTXDBOQQKO-UHFFFAOYSA-N
- CAS Registry Number: 86-98-6
- Chemical structure:
View 3d structure (requires JavaScript / HTML 5) - Other names: 4,7-Dichloroquinoline; TL 1473

Phase change data

Data compiled by: William E. Acree, Jr., James S. Chickos
Quantity | Value | Units | Method | Reference | Comment |
---|---|---|---|---|---|
ΔsubH° | 89.5 ± 2.3 | kJ/mol | C | da Silva, Matos, et al., 2006 |

References

da Silva, Matos, et al., 2006
da Silva, Manuel A.V. Ribeiro; Matos, R.; Amaral, Luísa M.P.F.,
Standard molar enthalpies of formation of 2-chloroquinoline, 4-chloroquinoline, 6-chloroquinoline and 4,7-dichloroquinoline by rotating-bomb calorimetry,
The Journal of Chemical Thermodynamics, 2006, 38, 1, 49-55, https://doi.org/10.1016/j.jct.2005.03.011
. [all data]