4-cyano-2-fluorophenyl-4-heptylbenzoate
- Formula: C21H22FNO2
- Molecular weight: 339.4033
- IUPAC Standard InChIKey: FTAVFGXNHIZTMG-UHFFFAOYSA-N
- CAS Registry Number: 86831-24-5
- Chemical structure:
View 3d structure (requires JavaScript / HTML 5) - Permanent link for this species. Use this link for bookmarking this species for future reference.

Phase change data

Data compiled by: Thermodynamics Research Center, NIST Boulder Laboratories, Chris Muzny director
Quantity | Value | Units | Method | Reference | Comment |
---|---|---|---|---|---|
Tfus | 320. | K | N/A | Kelly, 1984 | Nemactic liquid crystal phase; Uncertainty assigned by TRC = 1. K |

References

Kelly, 1984
Kelly, S.M.,
the synthesis and transition temperatures of benzoate ester derivatives of 2-fluoro-4-hydroxy- and 3-fluoro-4-hydro-4-hydroxybenzonitriles,
Helv. Chim. Acta, 1984, 67, 1572. [all data]