4-cyano-2-fluorophenyl-4-pentylbenzoate
- Formula: C19H18FNO2
- Molecular weight: 311.3501
- CAS Registry Number: 86831-22-3

Phase change data

Data compiled by: Thermodynamics Research Center, NIST Boulder Laboratories, Chris Muzny director
Quantity | Value | Units | Method | Reference | Comment |
---|---|---|---|---|---|
Tfus | 327. | K | N/A | Kelly, 1984 | Nemactic liquid crystal phase; Uncertainty assigned by TRC = 0.2 K |

References

Kelly, 1984
Kelly, S.M.,
the synthesis and transition temperatures of benzoate ester derivatives of 2-fluoro-4-hydroxy- and 3-fluoro-4-hydro-4-hydroxybenzonitriles,
Helv. Chim. Acta, 1984, 67, 1572. [all data]