Benzoic acid, 4-heptyl-, 4-cyano-3-fluorophenyl ester

Phase change data

Data compiled by: Thermodynamics Research Center, NIST Boulder Laboratories, Chris Muzny director

Quantity Value Units Method Reference Comment
Tfus300.KN/AKelly, 1984Nemactic liquid crystal phase; Uncertainty assigned by TRC = 1. K

In addition to the Thermodynamics Research Center (TRC) data available from this site, much more physical and chemical property data is available from the following TRC products:

References

Kelly, 1984
Kelly, S.M., the synthesis and transition temperatures of benzoate ester derivatives of 2-fluoro-4-hydroxy- and 3-fluoro-4-hydro-4-hydroxybenzonitriles, Helv. Chim. Acta, 1984, 67, 1572. [all data]