7-methyl-2-octene
- Formula: C9H18
- Molecular weight: 126.2392
- IUPAC Standard InChIKey: RGNHLFZGJBKNHR-SNAWJCMRSA-N
- CAS Registry Number: 86668-32-8
- Chemical structure:
View 3d structure (requires JavaScript / HTML 5) - Permanent link for this species. Use this link for bookmarking this species for future reference.

Phase change data

Data compiled by: Thermodynamics Research Center, NIST Boulder Laboratories, Chris Muzny director
Quantity | Value | Units | Method | Reference | Comment |
---|---|---|---|---|---|
Tboil | 415.69 | K | N/A | Spengler, 1948 | Uncertainty assigned by TRC = 0.5 K |
Tboil | 415.65 | K | N/A | Spengler, 1948 | Uncertainty assigned by TRC = 0.3 K |
Tboil | 415.76 | K | N/A | Spengler, 1948 | Uncertainty assigned by TRC = 0.3 K |

References

Spengler, 1948
Spengler, G.,
Unpublished, Inst. Kohleforschung, Prague, Czechosl- ovakia (transmitted by L. L. Newman, U. S, 1948. [all data]