1,1,1,2,2,3,4,4,5,5,5-undecafluoro-3-(trifluoromethyl)pentane
- Formula: C6F14
- Molecular weight: 338.0418
- IUPAC Standard InChIKey: GXSFAIDPYIEIEF-UHFFFAOYSA-N
- CAS Registry Number: 865-71-4
- Chemical structure:
View 3d structure (requires JavaScript / HTML 5) - Other names: Perfluoro-3-methylpentane

Phase change data

Data compiled as indicated in comments:
TRC - Thermodynamics Research Center, NIST Boulder Laboratories, Chris Muzny director
AC - William E. Acree, Jr., James S. Chickos
Quantity | Value | Units | Method | Reference | Comment |
---|---|---|---|---|---|
Ttriple | 157.75 | K | N/A | Crowder, Taylor, et al., 1967 | Uncertainty assigned by TRC = 0.3 K; TRC |
Enthalpy of vaporization
ΔvapH (kJ/mol) | Temperature (K) | Method | Reference | Comment |
---|---|---|---|---|
30.8 | 297. | A | Stephenson and Malanowski, 1987 | Based on data from 282. to 333. K.; AC |

References

Crowder, Taylor, et al., 1967
Crowder, G.A.; Taylor, Z.L.; Reed, T.M.; Young, J.A.,
Vapor Pressures and Triple Point Temp. for Several Pure Fluorocarbons fluorocarbons,
J. Chem. Eng. Data, 1967, 12, 481. [all data]
Stephenson and Malanowski, 1987
Stephenson, Richard M.; Malanowski, Stanislaw,
Handbook of the Thermodynamics of Organic Compounds, 1987, https://doi.org/10.1007/978-94-009-3173-2
. [all data]