iodo(2H3)methane
- Formula: CD3I
- Molecular weight: 144.9575
- IUPAC Standard InChIKey: INQOMBQAUSQDDS-FIBGUPNXSA-N
- CAS Registry Number: 865-50-9
- Chemical structure:
View 3d structure (requires JavaScript / HTML 5) - Isotopologues:
- Other names: iodomethane-d3

Vibrational and/or electronic energy levels

Data compiled by: Takehiko Shimanouchi
Symmetry: C3ν Symmetry Number σ = 3
Sym. | No | Approximate | Selected Freq. | Infrared | Raman | Comments | ||||
---|---|---|---|---|---|---|---|---|---|---|
Species | type of mode | Value | Rating | Value | Phase | Value | Phase | |||
a1 | 1 | CD3 s-str | 2130 | E | 2155.1 | gas | FR(2ν5) | |||
a1 | 1 | CD3 s-str | 2130 | E | 2081.0 | gas | FR(2ν5) | |||
a1 | 2 | CD3 s-deform | 951 | A | 950.7 | gas | ||||
a1 | 3 | CI str | 501 | A | 501.4 | gas | ||||
e | 4 | CD3 d-str | 2298 | A | 2298 | gas | ||||
e | 5 | CD3 d-deform | 1049 | A | 1049.3 | gas | ||||
e | 6 | CD3 rock | 656 | A | 655.9 | gas | ||||
Source: Shimanouchi, 1972

References

Shimanouchi, 1972
Shimanouchi, T.,
Tables of Molecular Vibrational Frequencies Consolidated Volume I, National Bureau of Standards, 1972, 1-160. [all data]