Methane-d, trichloro-
- Formula: CDCl3
- Molecular weight: 120.384
- IUPAC Standard InChIKey: HEDRZPFGACZZDS-MICDWDOJSA-N
- CAS Registry Number: 865-49-6
- Chemical structure:
View 3d structure (requires JavaScript / HTML 5) - Species with the same structure:
- Isotopologues:
- Other names: Trichloromethane-d; Deuterochloroform; (2H)chloroform; Trichloromethane-d1

Vibrational and/or electronic energy levels

Data compiled by: Takehiko Shimanouchi
Symmetry: C3ν Symmetry Number σ = 3
Sym. | No | Approximate | Selected Freq. | Infrared | Raman | Comments | ||||
---|---|---|---|---|---|---|---|---|---|---|
Species | type of mode | Value | Rating | Value | Phase | Value | Phase | |||
a1 | 1 | CD str | 2266 | C | 2266 W | gas | 2255 p | liq. | ||
a1 | 2 | CCl3 s-str | 659 | B | 658.5 S | gas | 649 p | liq. | ||
a1 | 3 | CCl3 s-deform | 369 | C | 366 W | liq. | 369 p | liq. | ||
e | 4 | CD bend | 914 | B | 913.9 VS | gas | 908 dp | liq. | ||
e | 5 | CCl3 d-str | 749 | B | 748.5 VS | gas | 735 dp | liq. | ||
e | 6 | CCl3 d-deform | 262 | C | 262 W | liq. | 262 dp | liq. | ||
Source: Shimanouchi, 1972

References

Shimanouchi, 1972
Shimanouchi, T.,
Tables of Molecular Vibrational Frequencies Consolidated Volume I, National Bureau of Standards, 1972, 1-160. [all data]