Ta(OMe)5
- Formula: C5H15O5Ta
- Molecular weight: 336.1175
- CAS Registry Number: 865-35-0

Phase change data

Data compiled by: José A. Martinho Simões
Quantity | Value | Units | Method | Reference | Comment |
---|---|---|---|---|---|
ΔsubH° | 21.1 ± 3.2 | kcal/mol | CC-SB | Tel'noi, Rabinovich, et al., 1972 |

Gas phase thermochemistry data

Data compiled by: José A. Martinho Simões

Quantity Value Units Method Reference Comment
Δfgas-328.1 ± 3.3kcal/molReviewMartinho SimõesThe enthalpy of formation, quoted from Tel'noi and Rabinovich, 1977, is probably a correction of the one given in the original reference, -888.29 kcal/mol Tel'noi, Rabinovich, et al., 1972, which leads to -339.20 kcal/mol for the enthalpy of formation of Ta(OMe)5(cr)

Condensed phase thermochemistry data

Data compiled by: José A. Martinho Simões

Quantity Value Units Method Reference Comment
Δfsolid-349.19 ± 0.65kcal/molReviewMartinho SimõesThe enthalpy of formation, quoted from Tel'noi and Rabinovich, 1977, is probably a correction of the one given in the original reference, -888.29 kcal/mol Tel'noi, Rabinovich, et al., 1972, which leads to -339.20 kcal/mol for the enthalpy of formation of Ta(OMe)5(cr)
Quantity Value Units Method Reference Comment
Δcsolid-878.30 ± 0.41kcal/molCC-SBTel'noi, Rabinovich, et al., 1972Please also see Tel'noi and Rabinovich, 1977.

References

Tel'noi, Rabinovich, et al., 1972
Tel'noi, V.I.; Rabinovich, I.B.; Kozyrkin, B.I.; Salamantin, B.A.; Kir'yanov, K.V.,
Dokl. Akad. Nauk SSSR, 1972, 205, 2, 364. [all data]