1-Naphthalenecarbonitrile
- Formula: C11H7N
- Molecular weight: 153.1800
- IUPAC Standard InChIKey: YJMNOKOLADGBKA-UHFFFAOYSA-N
- CAS Registry Number: 86-53-3
- Chemical structure:
View 3d structure (requires JavaScript / HTML 5) - Other names: 1-Naphthonitrile; α-Naphthonitrile; 1-Cyanonaphthalene; Naphthalene-1-carbonitrile; α-Cyanonaphthalene; 1-Naphthalenenitrile; α-Naphthylnitrile; 1-Naphthylnitrile; NSC 60230

Condensed phase thermochemistry data

Data compiled by: Hussein Y. Afeefy, Joel F. Liebman, and Stephen E. Stein
Quantity | Value | Units | Method | Reference | Comment |
---|---|---|---|---|---|
ΔcH°solid | -5578.1 | kJ/mol | Ccb | Lemoult and Jungfleisch, 1909 |

Phase change data

Data compiled as indicated in comments:
BS - Robert L. Brown and Stephen E. Stein
TRC - Thermodynamics Research Center, NIST Boulder Laboratories, Chris Muzny director
Quantity | Value | Units | Method | Reference | Comment |
---|---|---|---|---|---|
Tboil | 572.2 | K | N/A | Weast and Grasselli, 1989 | BS |
Tboil | 572.15 | K | N/A | Perkin, 1896 | Uncertainty assigned by TRC = 2. K; TRC |
Quantity | Value | Units | Method | Reference | Comment |
Tfus | 308.65 | K | N/A | Perkin, 1896 | Uncertainty assigned by TRC = 1.5 K; TRC |

Normal alkane RI, non-polar column, custom temperature program

Data compiled by: NIST Mass Spectrometry Data Center, William E. Wallace, director

Column type CapillaryCapillaryCapillaryOther
Active phase Polydimethyl siloxane, unknown content of Ph-groupsPolydimethyl siloxane, unknown content of Ph-groupsOV-1, SE-30, Methyl silicone, SP-2100, OV-101, DB-1, etc.Methyl Silicone
Column length (m)   50.
Carrier gas   Hydrogen
Substrate
Column diameter (mm)   0.32
Phase thickness (μm)
Program not specifiednot specifiednot specifiednot specified
I 1500.1503.1489.1489.
ReferenceGeldon, 1989Geldon, 1989Waggott and Davies, 1984Ardrey and Moffat, 1981
Comment MSDC-RI MSDC-RI MSDC-RI MSDC-RI

Gas phase ion energetics data

Data compiled as indicated in comments:
LBLHLM - Sharon G. Lias, John E. Bartmess, Joel F. Liebman, John L. Holmes, Rhoda D. Levin, and W. Gary Mallard
LLK - Sharon G. Lias, Rhoda D. Levin, and Sherif A. Kafafi
B - John E. Bartmess

Electron affinity determinations

EA (eV) Method Reference Comment
0.68 ± 0.10IMREHeinis, Chowdhury, et al., 1993ΔGea(423 K)= -15.6 kcal/mol , ΔSea=+0.0 (entropy estimated); B

Ionization energy determinations

IE (eV) Method Reference Comment
8.59PEKlasinc, Kovac, et al., 1983LBLHLM
8.61PEUtsunomiya, Kobayashi, et al., 1975Vertical value; LLK

References

Lemoult and Jungfleisch, 1909
Lemoult, M.P.; Jungfleisch, M.E.,
Thermochimie. - Comparaisons entre les nitriles et les carbylamines,
Compt. Rend., 1909, 148, 1602-1604. [all data]
Weast and Grasselli, 1989
CRC Handbook of Data on Organic Compounds, 2nd Editon, Weast,R.C and Grasselli, J.G., ed(s)., CRC Press, Inc., Boca Raton, FL, 1989, 1. [all data]
Perkin, 1896
Perkin, W.H.,
LXIX. On Magnetic Rotatory Power, especially of Aromatic Compounds,
J. Chem. Soc., 1896, 69, 1025-1257. [all data]