Azinphos-methyl
- Formula: C10H12N3O3PS2
- Molecular weight: 317.324
- IUPAC Standard InChIKey: CJJOSEISRRTUQB-UHFFFAOYSA-N
- CAS Registry Number: 86-50-0
- Chemical structure:
View 3d structure (requires JavaScript / HTML 5) - Other names: Phosphorodithioic acid, O,O-dimethyl S-[(4-oxo-1,2,3-benzotriazin-3(4H)-yl)methyl] ester; Phosphorodithioic acid, O,O-dimethyl ester, S-ester with 3-(mercaptomethyl)-1,2,3-benzotriazin-4(3H)-one; Azinfos-Methyl; Azinphos; Bayer 17147; Cotneon; Cotnion; ENT 23,233; Gusathion; Gusathion Methyl; Gusathion K; Gusathion M; Gusathion 25; Gusathion-20; Guthion; Methyl gusathion; Methyl guthion; S-(3,4-Dihydro-4-oxobenzo[d]-[1,2,3]-triazin-3-ylmethyl)OO-dimethyl-phosphorodithioate; Azinophos-methyl; Azinphos-metile; BAY 9027; BAY 17147; Bayer 9027; Benzotriazinedithiophosphoric acid dimethoxy ester; 1,2,3-Benzotriazin-4(3H)-one, 3-(mercaptomethyl)-, O,O-dimethyl phosphorodithioate; Carfene; Cotnion methyl; Crysthion 2L; Crysthyon; S-(3,4-Dihydro-4-oxo-1,2,3-benzotriazin-3-ylmethyl) O,O-dimethyl phosphorodithioate; O,O-Dimethyl-S-(benzaziminomethyl) dithiophosphate; O,O-Dimethyl-S-(1,2,3-benzotriazinyl-4-keto)methyl phosphorodithioate; O,O-Dimethyl S-(3,4-dihydro-4-keto-1,2,3-benzotriazinyl-3-methyl) dithiophosphate; Dimethyldithiophosphoric acid N-methylbenzazimide ester; O,O-Dimethyl S-(4-oxo-3H-1,2,3-benzotriazine-3-methyl)phosphorodithioate; O,O-Dimethyl S-(4-oxobenzotriazino-3-methyl)phosphorodithioate; O,O-Dimethyl S-(4-oxo-1,2,3-benzotriazino(3)-methyl) thiothionophosphate; O,O-Dimethyl-S-(4-oxobenzotriazin-3-methyl)-dithiophosphat; O,O-Dimethyl-S-((4-oxo-3H-1,2,3-benzotriazin-3-yl)-methyl)-dithiofosfaat; O,O-Dimethyl-S-((4-oxo-3H-1,2,3-benzotriazin-3-yl)-methyl)-dithiophosphat; O,O-Dimethyl S-4-oxo-1,2,3-benzotriazin-3(4H)-ylmethyl phosphorodithioate; O,O-Dimetil-S-((4-oxo-3H-1,2,3-benzotriazin-3-il)-metil)-ditiofosfato; Gothnion; 3-(Mercaptomethyl)-1,2,3-benzotriazin-4(3H)-one O,O-dimethyl phosphorodithioate S-ester; Methylazinphos; N-Methylbenzazimide, dimethyldithiophosphoric acid ester; Metiltriazotion; NA 2783; NCI-C00066; R 1582; Azinugec; O,O-Dimethyl S-(3,4-dihydro-4-oxo-1,2,3-benzotriazin-3-yl-methyl) dithiophosphate; S-(3,4-dihydro-4-oxobenzo[d] [1,2,3]-triazin-3-ylmethyl) O,O-dimethylphoshorodithioate

Phase change data

Data compiled as indicated in comments:
TRC - Thermodynamics Research Center, NIST Boulder Laboratories, Chris Muzny director
AC - William E. Acree, Jr., James S. Chickos
Quantity | Value | Units | Method | Reference | Comment |
---|---|---|---|---|---|
Tfus | 346.28 | K | N/A | Donnelly, Drewes, et al., 1990 | Uncertainty assigned by TRC = 0.2 K; TRC |
Tfus | 344.5 | K | N/A | Plato and Glasgow, 1969 | Uncertainty assigned by TRC = 0.2 K; TRC |
Enthalpy of fusion
ΔfusH (kJ/mol) | Temperature (K) | Method | Reference | Comment |
---|---|---|---|---|
27.76 | 345.3 | DSC | Acree, 1991 | See also Donnelly, Drewes, et al., 1990, 2.; AC |

Normal alkane RI, non-polar column, custom temperature program

Column type | Active phase | I | Reference | Comment |
---|---|---|---|---|
Capillary | OV-1 | 2464. | Waggott and Davies, 1984 | Hydrogen; Column length: 50. m; Column diameter: 0.32 mm; Program: not specified |

References

Donnelly, Drewes, et al., 1990
Donnelly, J.R.; Drewes, L.A.; Johnson, R.L.; Munslow, W.D.; Knapp, K.K.; Sovocool, G.W.,
Purity and heat of fusion data for environmental standards as determined by differential scanning calorimetry,
Thermochim. Acta, 1990, 167, 2, 155, https://doi.org/10.1016/0040-6031(90)80476-F
. [all data]
Plato and Glasgow, 1969
Plato, C.; Glasgow, A.R., Jr.,
Differential scanning calorimetry as a general method for determining the purity and heat of fusion of high-purity organic chemicals. Application to 95 compounds,
Anal. Chem., 1969, 41, 2, 330, https://doi.org/10.1021/ac60271a041
. [all data]
Acree, 1991
Acree, William E.,
Thermodynamic properties of organic compounds: enthalpy of fusion and melting point temperature compilation,
Thermochimica Acta, 1991, 189, 1, 37-56, https://doi.org/10.1016/0040-6031(91)87098-H
. [all data]
Donnelly, Drewes, et al., 1990, 2
Donnelly, J.R.; Drewes, L.A.; Johnson, R.L.; Munslow, W.D.; Knapp, K.K.; Sovocool, G.W.,
Purity and heat of fusion data for environmental standards as determined by differential scanning calorimetry,
Thermochimica Acta, 1990, 167, 2, 155-187, https://doi.org/10.1016/0040-6031(90)80476-F
. [all data]