N-Nitrosodiphenylamine
- Formula: C12H10N2O
- Molecular weight: 198.2206
- IUPAC Standard InChIKey: UBUCNCOMADRQHX-UHFFFAOYSA-N
- CAS Registry Number: 86-30-6
- Chemical structure:
View 3d structure (requires JavaScript / HTML 5) - Other names: Benzenamine, N-nitroso-N-phenyl-; Diphenylamine, N-nitroso-; Diphenylnitrosamine; N-Nitroso-N-phenylaniline; N,N-Diphenylnitrosamine; Nitrosodiphenylamine; Redax; Retarder J; Vulcatard A; Vulkalent A; Vultrol; Diphenylnitrosamin; N-Nitrosodifenylamin; NCI-C02880; Vulcatard; Curetard A; Delac J; Difenylnitrosamin; Diphenyl N-nitrosoamine; Naugard tjb; Ndpa; NdphA; TJB; Vulcalent A; N-Nitroso-N-diphenylamine; N,N-Diphenyl-N-nitrosoamine; NSC 585; Ortard; Sconoc

Condensed phase thermochemistry data

Data compiled by: Hussein Y. Afeefy, Joel F. Liebman, and Stephen E. Stein
Quantity | Value | Units | Method | Reference | Comment |
---|---|---|---|---|---|
ΔfH°solid | 227. ± 6.3 | kJ/mol | Ccb | Medard and Thomas, 1954 | Heat of combustion corrected for pressure |
ΔfH°solid | 237.3 | kJ/mol | Ccb | Medard, 1954 | Heat of combustion corrected for pressure |
Quantity | Value | Units | Method | Reference | Comment |
ΔcH°solid | -6378.5 ± 6.3 | kJ/mol | Ccb | Medard and Thomas, 1954 | Heat of combustion corrected for pressure |
ΔcH°solid | -6388.59 | kJ/mol | Ccb | Medard, 1954 | Heat of combustion corrected for pressure |

Reaction thermochemistry data

Data compiled by: Hussein Y. Afeefy, Joel F. Liebman, and Stephen E. Stein
Individual Reactions
By formula: C12H11N + HNO2 = H2O + C12H10N2O
Quantity | Value | Units | Method | Reference | Comment |
---|---|---|---|---|---|
ΔrH° | -62.84 | kJ/mol | Cm | Swientoslawski, 1910 | solid phase |

Kovats' RI, non-polar column, isothermal

Column type | Active phase | Temperature (C) | I | Reference | Comment |
---|---|---|---|---|---|
Packed | SE-52 | 210. | 1865. | Gough and Webb, 1974 | He; Column length: 1.5 m |

Lee's RI, non-polar column, temperature ramp

Column type | Active phase | I | Reference | Comment |
---|---|---|---|---|
Capillary | DB-5 | 274.9 | Donnelly, Abdel-Hamid, et al., 1993 | 30. m/0.32 mm/0.25 μm, He, 40. C @ 3. min, 8. K/min, 285. C @ 29.5 min |

References

Medard and Thomas, 1954
Medard, L.; Thomas, M.,
Chaleurs de combustion de vingt-quatre substances explosives ou apparentees a des explosifs,
Mem. Poudres, 1954, 36, 97-127. [all data]
Medard, 1954
Medard, L.,
Tables thermochimiques a l'usage des techniciens des substances explosives,
Mem. Artillerie Fr. Sci. Tech. Armement, 1954, 28, 415-492. [all data]
Swientoslawski, 1910
Swientoslawski, W.,
Thermochemische Untersuchungen der organischen Verbindungen. Dritte Mitteilung. Stickstoffhaltige Verbindungen.,
Z. Phys. Chem., 1910, 72, 49-83. [all data]
Gough and Webb, 1974
Gough, T.A.; Webb, K.S.,
The Trace Detection of Some Non-Volatile Nitrosamines by Combined Gas Chromatography and Mass Spectrometry,
J. Chromatogr., 1974, 95, 1, 59-63, https://doi.org/10.1016/S0021-9673(00)84095-9
. [all data]
Donnelly, Abdel-Hamid, et al., 1993
Donnelly, J.R.; Abdel-Hamid, M.S.; Jeter, J.L.; Gurka, D.F.,
Application of gas chromatographic retention properties to the identification of environmental contaminants,
J. Chromatogr., 1993, 642, 1-2, 409-415, https://doi.org/10.1016/0021-9673(93)80106-I
. [all data]