9H-Carbazole, 9-ethyl-
- Formula: C14H13N
- Molecular weight: 195.2597
- IUPAC Standard InChIKey: PLAZXGNBGZYJSA-UHFFFAOYSA-N
- CAS Registry Number: 86-28-2
- Chemical structure:
View 3d structure (requires JavaScript / HTML 5) - Other names: Carbazole, 9-ethyl-; N-Ethylcarbazole; 9-Ethylcarbazole

Condensed phase thermochemistry data

Data compiled as indicated in comments:
ALS - Hussein Y. Afeefy, Joel F. Liebman, and Stephen E. Stein
DH - Eugene S. Domalski and Elizabeth D. Hearing
Quantity | Value | Units | Method | Reference | Comment |
---|---|---|---|---|---|
ΔfH°solid | 70.6 ± 2.6 | kJ/mol | Ccb | Jimenez, Roux, et al., 1990 | ALS |
Quantity | Value | Units | Method | Reference | Comment |
ΔcH°solid | -7437.6 ± 1.8 | kJ/mol | Ccb | Jimenez, Roux, et al., 1990 | ALS |
Constant pressure heat capacity of solid
Cp,solid (J/mol*K) | Temperature (K) | Reference | Comment |
---|---|---|---|
238.2 | 298.15 | Jimenez, Roux, et al., 1990 | DH |

Phase change data

Data compiled as indicated in comments:
TRC - Thermodynamics Research Center, NIST Boulder Laboratories, Chris Muzny director
ALS - Hussein Y. Afeefy, Joel F. Liebman, and Stephen E. Stein
DRB - Donald R. Burgess, Jr.
AC - William E. Acree, Jr., James S. Chickos
Quantity | Value | Units | Method | Reference | Comment |
---|---|---|---|---|---|
Tfus | 344. | K | N/A | Lopatinskii, Sirotkina, et al., 1964 | Uncertainty assigned by TRC = 4. K; TRC |
Tfus | 341. | K | N/A | Adkins and Coonradt, 1941 | Uncertainty assigned by TRC = 3. K; TRC |
Tfus | 340.65 | K | N/A | Von Auwers and Kraul, 1925 | Uncertainty assigned by TRC = 2. K; TRC |
Tfus | 340.65 | K | N/A | Burton and Gibson, 1924 | Uncertainty assigned by TRC = 1.5 K; TRC |
Quantity | Value | Units | Method | Reference | Comment |
ΔsubH° | 99.1 ± 0.3 | kJ/mol | V | Jimenez, Roux, et al., 1990 | ALS |
ΔsubH° | 99.1 | kJ/mol | N/A | Jimenez, Roux, et al., 1990 | DRB |
ΔsubH° | 99.1 ± 0.3 | kJ/mol | ME | Jimenez, Roux, et al., 1990 | AC |
Enthalpy of sublimation
ΔsubH (kJ/mol) | Temperature (K) | Method | Reference | Comment |
---|---|---|---|---|
98.4 ± 0.3 | 319. | ME | Jimenez, Roux, et al., 1990 | Based on data from 310. to 329. K.; AC |

References

Jimenez, Roux, et al., 1990
Jimenez, P.; Roux, M.V.; Turrion, C.,
Thermochemical properties of N-heterocyclic compounds. III. Enthalpies of combustion, vapour pressures and enthalpies of sublimation, and enthalpies of formation of 9H-carbazole, 9-methylcarbazole, and 9-ethylcarbazole,
J. Chem. Thermodyn., 1990, 22, 721-726. [all data]
Lopatinskii, Sirotkina, et al., 1964
Lopatinskii, V.P.; Sirotkina, E.E.; Sukhoroslava, M.M.,
N-Alkylcarbazoles,
Metody Poluch. Khim. Reak. Prep., 1964, 1964, No. 11, 69-72. [all data]
Adkins and Coonradt, 1941
Adkins, H.; Coonradt, H.L.,
The Selective Hydrogenation of Derivatives of Pyrrole, Indole, Carbazole and Acridine,
J. Am. Chem. Soc., 1941, 63, 1563-70. [all data]
Von Auwers and Kraul, 1925
Von Auwers, K.; Kraul, R.,
The Spectrochemistry of Compounds Containing Nitrogen.,
Z. Phys. Chem., Stoechiom. Verwandtschaftsl., 1925, 116, 438. [all data]
Burton and Gibson, 1924
Burton, H.; Gibson, C.S.,
New method for the preparation of 9-carbazoles,
J. Chem. Soc., 1924, 125, 2501. [all data]