1,1'-Biphenyl, 2-nitro-
- Formula: C12H9NO2
- Molecular weight: 199.2054
- IUPAC Standard InChIKey: YOJKKXRJMXIKSR-UHFFFAOYSA-N
- CAS Registry Number: 86-00-0
- Chemical structure:
View 3d structure (requires JavaScript / HTML 5) - Other names: Biphenyl, 2-nitro-; o-Nitrobiphenyl; o-Nitrodiphenyl; Onb; 2-Nitrobiphenyl; 2-Nitrodiphenyl

Phase change data

Data compiled by: Robert L. Brown and Stephen E. Stein
Quantity | Value | Units | Method | Reference | Comment |
---|---|---|---|---|---|
Tboil | 593.2 | K | N/A | Weast and Grasselli, 1989 |
Reduced pressure boiling point
Tboil (K) | Pressure (bar) | Reference |
---|---|---|
440.7 | 0.017 | Aldrich Chemical Company Inc., 1990 |

Gas phase ion energetics data

Data compiled by: John E. Bartmess
Electron affinity determinations
EA (eV) | Method | Reference | Comment |
---|---|---|---|
1.07 ± 0.10 | IMRE | Chowdhury, Kishi, et al., 1989 | ΔGea(423 K) = -23.8 kcal/mol, ΔS = -2 eu est |

Kovats' RI, non-polar column, isothermal

Column type | Active phase | Temperature (C) | I | Reference | Comment |
---|---|---|---|---|---|
Capillary | DB-5 | 140. | 1691.22 | Hobbs and Conde, 1992 | 30. m/0.25 mm/0.25 μm |
Capillary | DB-5 | 140. | 1696.33 | Hobbs and Conde, 1992 | 30. m/0.25 mm/0.25 μm |
Capillary | SE-30 | 180. | 1670. | Korhonen and Lind, 1985 | N2; Column length: 25. m; Column diameter: 0.33 mm |
Capillary | SE-30 | 220. | 1698. | Korhonen and Lind, 1985 | N2; Column length: 25. m; Column diameter: 0.33 mm |

Van Den Dool and Kratz RI, non-polar column, temperature ramp

Column type | Active phase | I | Reference | Comment |
---|---|---|---|---|
Capillary | DB-5 | 1700.00 | Hobbs and Conde, 1992 | 30. m/0.25 mm/0.25 μm, 5. K/min; Tstart: 40. C; Tend: 300. C |
Capillary | DB-5 | 1700.00 | Hobbs and Conde, 1992 | 30. m/0.25 mm/0.25 μm, 5. K/min; Tstart: 40. C; Tend: 300. C |
Capillary | SE-30 | 1669. | Korhonen and Lind, 1985 | N2, 10. K/min; Column length: 25. m; Column diameter: 0.33 mm; Tstart: 100. C; Tend: 320. C |
Capillary | SE-30 | 1669. | Korhonen and Lind, 1985 | N2, 6. K/min; Column length: 25. m; Column diameter: 0.33 mm; Tstart: 140. C; Tend: 320. C |

Normal alkane RI, non-polar column, isothermal

Column type | Active phase | Temperature (C) | I | Reference | Comment |
---|---|---|---|---|---|
Capillary | SE-30 | 200. | 1686. | Korhonen and Lind, 1985 | N2; Column length: 25. m; Column diameter: 0.33 mm |

Normal alkane RI, non-polar column, custom temperature program

Column type | Active phase | I | Reference | Comment |
---|---|---|---|---|
Capillary | OV-1, SE-30, Methyl silicone, SP-2100, OV-101, DB-1, etc. | 1669. | Waggott and Davies, 1984 | Hydrogen; Column length: 50. m; Column diameter: 0.32 mm; Program: not specified |

Lee's RI, non-polar column, temperature ramp

Column type | Active phase | I | Reference | Comment |
---|---|---|---|---|
Capillary | SE-52 | 290.25 | Boenke and Ballschmiter, 1987 | Hydrogen, 3. K/min; Column length: 12. m; Tstart: 120. C; Tend: 285. C |
Capillary | SE-52 | 288.70 | White, Robbat, et al., 1983 | 30. m/0.3 mm/0.25 μm, He, 4. K/min; Tstart: 25. C; Tend: 295. C |
Capillary | SE-52 | 288.56 | White, Robbat, et al., 1983 | 30. m/0.2 mm/0.25 μm, He, 4. K/min; Tstart: 25. C; Tend: 295. C |
Capillary | SE-52 | 284.73 | White, Robbat, et al., 1983 | 30. m/0.3 mm/0.25 μm, He, 4. K/min; Tstart: 100. C; Tend: 300. C |
Capillary | SE-52 | 288.54 | White, Robbat, et al., 1983 | 30. m/0.3 mm/0.25 μm, He, 4. K/min; Tstart: 40. C; Tend: 300. C |
Capillary | SE-52 | 287.61 | White, Robbat, et al., 1983 | 30. m/0.3 mm/0.25 μm, He, 4. K/min; Tstart: 70. C; Tend: 300. C |
Capillary | SE-52 | 290.25 | Vassilaros, Kong, et al., 1982 | 20. m/0.30 mm/0.25 μm, H2, 40. C @ 2. min, 4. K/min; Tend: 265. C |

Lee's RI, non-polar column, custom temperature program

Column type | Active phase | I | Reference | Comment |
---|---|---|---|---|
Capillary | OV-101 | 285.8 | Tucminen, Wickstrom, et al., 1986 | Program: not specified |

References

Weast and Grasselli, 1989
CRC Handbook of Data on Organic Compounds, 2nd Editon, Weast,R.C and Grasselli, J.G., ed(s)., CRC Press, Inc., Boca Raton, FL, 1989, 1. [all data]
Aldrich Chemical Company Inc., 1990
Aldrich Chemical Company Inc.,
Catalog Handbook of Fine Chemicals, Aldrich Chemical Company, Inc., Milwaukee WI, 1990, 1. [all data]
Chowdhury, Kishi, et al., 1989
Chowdhury, S.; Kishi, H.; Dillow, G.W.; Kebarle, P.,
Electron Affinities of Substituted Nitrobenzenes,
Can. J. Chem., 1989, 67, 4, 603, https://doi.org/10.1139/v89-091
. [all data]
Grammaticakis, 1955
Grammaticakis, P.,
Remarques sur l'absorption des derives du diphenyle dans l'ultraviolet moyen et le visible,
Compt. Rend., 1955, 241, 59-61. [all data]
Hobbs and Conde, 1992
Hobbs, J.R.; Conde, E.P.,
Gas chromatographic retention indices of explosives and nitro-compounds
in Advances in Analysis and Detection of Explosives: Proceedings of the 4th International Symposium on Analysis of Detection of Explosives, September 7-10, 1992, Jerusalem Israel, J. Yinon, ed(s)., Kluwer Academic Publishers, Netherlands, 1992, 153-164. [all data]
Korhonen and Lind, 1985
Korhonen, I.O.O.; Lind, M.A.,
Gas-liquid chromatographic analyses. XXXIV. Separation and retention indices with retention increments of some nitrated polynuclear aromatic hydrocarbons on a low-polarity (SE-30) capillary column,
J. Chromatogr., 1985, 322, 71-81, https://doi.org/10.1016/S0021-9673(01)97660-5
. [all data]
Waggott and Davies, 1984
Waggott, A.; Davies, I.W.,
Identification of organic pollutants using linear temperature programmed retention indices (LTPRIs) - Part II, 1984, retrieved from http://dwi.defra.gov.uk/research/completed-research/reports/dwi0383.pdf. [all data]
Boenke and Ballschmiter, 1987
Boenke, A.; Ballschmiter, K.,
Fused quinones as retention index marker in high resolution gas chromatography with electron-capture detection (HRGC/ECD) of oxidized aromatic compounds,
Fresenius J. Anal. Chem., 1987, 327, 1, 44-45, https://doi.org/10.1007/BF00474554
. [all data]
White, Robbat, et al., 1983
White, C.M.; Robbat, A., Jr.; Hoes, R.M.,
Gas chromatographic retention characteristics of nitrated polycyclic aromatic hydrocarbons on SE-52,
Chromatographia, 1983, 17, 11, 605-612, https://doi.org/10.1007/BF02261944
. [all data]
Vassilaros, Kong, et al., 1982
Vassilaros, D.L.; Kong, R.C.; Later, D.W.; Lee, M.L.,
Linear retention index system for polycyclic aromatic compounds. Critical evaluation and additional indices,
J. Chromatogr., 1982, 252, 1-20, https://doi.org/10.1016/S0021-9673(01)88394-1
. [all data]
Tucminen, Wickstrom, et al., 1986
Tucminen, A.; Wickstrom, K.; Pyysalo, H.,
Determination of Polycyclic Aromatic Compounds by GLC-Selected Ion Monitoring (SIM) Technique,
J. Hi. Res. Chromatogr. Chromatogr. Comm., 1986, 9, 8, 469-471, https://doi.org/10.1002/jhrc.1240090813
. [all data]