18-Butylpentatriacontane

Phase change data

Data compiled by: William E. Acree, Jr., James S. Chickos

Enthalpy of fusion

ΔfusH (kJ/mol) Temperature (K) Method Reference
104.318.5DSCIkedou, Yamamoto, et al., 2005

References

Ikedou, Yamamoto, et al., 2005
Ikedou, Keisuke; Yamamoto, Hiroko; Nagashima, Hideo; Nemoto, Norio; Tashiro, Kohji, Crystal Structures of n -Alkanes with Branches of Different Size in the Middle, J. Phys. Chem. B, 2005, 109, 21, 10668-10675, https://doi.org/10.1021/jp044119w . [all data]