5,6-Dibutyl-5,6-bis(4-tert-butylphenyl)decane
- Formula: C38H62
- Molecular weight: 518.8989
- IUPAC Standard InChIKey: DMHYTJAITPRFFD-UHFFFAOYSA-N
- CAS Registry Number: 85668-76-4
- Chemical structure:
View 3d structure (requires JavaScript / HTML 5) - Permanent link for this species. Use this link for bookmarking this species for future reference.

Phase change data

Data compiled as indicated in comments:
TRC - Thermodynamics Research Center, NIST Boulder Laboratories, Chris Muzny director
ALS - Hussein Y. Afeefy, Joel F. Liebman, and Stephen E. Stein
DRB - Donald R. Burgess, Jr.
AC - William E. Acree, Jr., James S. Chickos
Quantity | Value | Units | Method | Reference | Comment |
---|---|---|---|---|---|
Tfus | 385. | K | N/A | Kratt, Beckhaus, et al., 1983 | Uncertainty assigned by TRC = 1. K; TRC |
Quantity | Value | Units | Method | Reference | Comment |
ΔsubH° | 221. | kJ/mol | E | Kratt, Beckhaus, et al., 1983, 2 | ΔHfussion = 10.3±0.1 kcal/mol at 112°C; ALS |
ΔsubH° | 220.3 | kJ/mol | N/A | Kratt, Beckhaus, et al., 1983, 2 | DRB |
Enthalpy of fusion
ΔfusH (kJ/mol) | Temperature (K) | Method | Reference | Comment |
---|---|---|---|---|
43.1 | 386. | DSC | Kratt, Beckhaus, et al., 1983 | AC |

Condensed phase thermochemistry data

Data compiled as indicated in comments:
ALS - Hussein Y. Afeefy, Joel F. Liebman, and Stephen E. Stein
DH - Eugene S. Domalski and Elizabeth D. Hearing
Quantity | Value | Units | Method | Reference | Comment |
---|---|---|---|---|---|
ΔfH°solid | -136.54 ± 0.53 | kcal/mol | Ccb | Kratt, Beckhaus, et al., 1983 | ΔHfussion = 10.3±0.1 kcal/mol at 112°C; ALS |
Quantity | Value | Units | Method | Reference | Comment |
ΔcH°solid | -5555.15 ± 0.53 | kcal/mol | Ccb | Kratt, Beckhaus, et al., 1983 | ΔHfussion = 10.3±0.1 kcal/mol at 112°C; Corresponding ΔfHºsolid = -136.56 kcal/mol (simple calculation by NIST; no Washburn corrections); ALS |
Constant pressure heat capacity of solid
Cp,solid (cal/mol*K) | Temperature (K) | Reference | Comment |
---|---|---|---|
192.5 | 298. | Kratt, Beckhaus, et al., 1983, 2 | Cp given as 0.371 cal/g*K.; DH |

Gas phase thermochemistry data

Data compiled as indicated in comments:
ALS - Hussein Y. Afeefy, Joel F. Liebman, and Stephen E. Stein

Quantity Value Units Method Reference Comment
Δfgas-245.kJ/molSemiStewart, 2004
Δfgas-351. ± 3.kJ/molCcbKratt, Beckhaus, et al., 1983ΔHfussion = 10.3±0.1 kcal/mol at 112°C; ALS

References

Kratt, Beckhaus, et al., 1983
Kratt, G.; Beckhaus, H.D.; Bernioehr, W.; Ruechardt, C.,
Thermolabile hydrocarbons. XVII. Enthalpies of combustion and formation of ten sym-tetraalkyl-1,2-diarylethanes,
Thermochim. Acta, 1983, 62, 279-294. [all data]
Kratt, Beckhaus, et al., 1983, 2
Kratt, G.; Beckhaus, H.D.; Bernlohr, W.; Ruchardt, C.,
Thermolabile kohlenwasserstoffe. XVII. Verbrennungsenthalpie und bildungsenthalpie von zehn sym.-tetraalkyl-1,2-diarylethanen,
Thermochim. Acta, 1983, 62, 279-194. [all data]